program: Gaussian 09
title: 000227006
version: EM64L-G09RevD.01
frameworkgroup: C1[X(C15H17N3O2S)]
method: RPBEPBE
basis: SDD
operation: Freq
keyword: #p
keyword: freq=noraman
keyword: PBEPBE/SDD
title: #p freq=noraman PBEPBE/SDD
converged: YES YES NO NO
title: Mulliken charges:
elementType: S O O N N N C C C C C C C C C C C C C C C H H H H H H H H H H H H H H H H H
charge: 0.961493 -0.545206 -0.520807 -0.503110 0.010405 -0.687415 -0.637319 -0.076948 0.492534 0.170947 -0.214060 -0.204989 -0.443309 -0.388788 -0.789870 0.512970 -0.386732 -0.390521 -0.219626 -0.217203 -0.248113 0.251803 0.216118 0.302342 0.277435 0.282153 0.232383 0.252215 0.233559 0.255035 0.255379 0.229722 0.230082 0.225929 0.224820 0.228282 0.314483 0.313928
chargesum: 0.00000
title: Mulliken charges with hydrogens summed into heavy atoms:
elementType: S O O N N N C C C C C C C C C C C C C C C
charge: 0.961493 -0.545206 -0.520807 -0.200768 0.010405 -0.059004 -0.169399 -0.076948 0.492534 0.170947 0.063375 0.077164 -0.210927 -0.136573 -0.045897 0.512970 -0.157009 -0.160439 0.006303 0.007617 -0.019831
polarizability: 2.78203116e+02 -1.88013081e+01 2.42235650e+02 1.19643567e+01 -8.93992440e+00 1.68263285e+02
1716.lowfreq: -8.3048 -1.8089 -0.0008 -0.0007 0.0006 4.2379 10.8150 17.6356 27.5755
frequency: 10.5479 17.4571 27.5460 35.4048 38.7725 65.8576 80.0261 96.0353 106.8516 131.5731 142.7521 187.9664 197.7430 224.3236 230.7197 270.2311 299.8782 311.9937 353.8105 362.9211 392.3671 402.9104 404.9690 408.3804 413.8322 423.7080 427.7367 439.9871 467.7855 506.7558 522.9063 581.1072 601.7491 610.7875 617.5064 622.6736 706.3071 720.4134 729.0175 769.7209 800.7027 804.4386 811.6807 816.7258 834.0603 841.3988 857.0358 901.2693 934.6197 946.4513 955.2990 965.6198 969.1738 979.7341 983.6653 990.1077 996.9256 1016.2424 1022.4203 1026.6476 1053.1869 1058.0011 1085.5470 1130.9751 1171.3133 1182.0664 1184.1847 1187.5450 1203.2659 1269.6823 1288.9532 1299.9755 1301.3842 1321.7299 1332.9420 1381.9525 1388.8087 1400.4305 1435.3959 1439.4283 1449.8500 1463.3761 1467.4805 1483.0155 1490.3651 1582.8563 1586.7649 1595.1772 1613.0830 1614.7996 1648.7335 2955.8058 2981.8852 3032.6768 3052.0126 3105.6556 3114.5181 3120.2423 3133.3615 3134.0575 3136.6308 3143.8104 3162.1264 3163.3018 3169.6518 3235.4206 3562.9292 3702.0014
redmass: 5.7711 4.1027 4.0232 3.7776 4.8184 4.9340 1.9341 4.1283 1.7643 6.8828 5.2342 7.0128 7.4492 3.8598 7.5294 5.1684 5.2809 5.9715 3.3157 2.1391 3.8005 5.6598 2.8263 1.0139 2.9560 1.5203 5.1816 3.4650 2.9500 4.3524 2.8229 3.1732 4.9212 4.0178 6.0361 6.9063 1.9721 2.8445 2.1442 2.1987 7.4997 3.5646 6.1751 1.2598 1.8721 2.6195 1.2476 1.5803 1.6387 10.9994 1.3801 1.6490 1.6639 1.3858 4.5920 6.1838 1.3171 1.5442 1.4386 2.2112 2.4563 2.3160 1.6526 1.1935 1.0583 1.2401 1.1706 1.1146 2.4357 2.1938 1.3357 1.2979 1.7034 2.6128 1.3450 7.9413 1.2117 5.6224 3.7458 1.9967 1.1510 1.0872 1.0636 2.2074 2.9413 7.8901 7.3994 6.1881 6.0741 4.8241 1.2254 1.0422 1.0621 1.0933 1.0982 1.0969 1.0870 1.0865 1.0913 1.0892 1.0894 1.0961 1.1015 1.0959 1.0960 1.0738 1.0452 1.1040
irintensity: 1.0452 2.0890 0.3286 0.5129 1.9608 1.3505 1.4612 0.6377 0.5124 0.4429 0.8086 3.6384 0.9396 5.1930 11.6968 14.1539 22.9255 2.1229 13.9147 1.8203 22.3112 31.4501 0.3334 0.6959 0.1841 150.6125 16.2723 284.0836 17.5273 5.5111 35.5348 18.6096 1.9232 46.7531 0.8977 0.4459 40.4740 8.3010 100.6199 81.5564 56.8005 7.6343 61.7010 0.4453 68.4669 74.6104 0.2098 9.3664 4.6098 73.2347 0.8751 3.5581 1.2283 0.0878 7.5089 0.4587 0.3657 1.2595 1.5716 7.8560 48.3258 22.5566 15.8464 13.4113 0.5278 28.5641 24.3178 1.4801 1.4560 9.5050 5.8952 5.9509 22.1422 67.8469 2.4108 0.3212 36.6318 4.3179 2.0323 4.1739 22.0916 28.4448 13.9315 23.4413 68.0494 29.7495 8.3615 2.8726 9.4706 166.8907 263.8991 14.7620 22.6445 17.9097 7.1626 14.7783 8.1950 1.6030 10.6270 13.8217 14.1852 40.4544 27.8266 4.3124 7.4914 7.9212 110.4706 25.1049
temp: 298.150 k
press: 1.00000 atm
elementType: 16 8 8 7 7 7 6 6 6 6 6 6 6 6 6 6 6 6 6 6 6 1 1 1 1 1 1 1 1 1 1 1 1 1 1 1 1 1
symmnumber: 1
zpe: 768215.5 jmol-1
zpe.correction: 0.292598 hartree
zpe.thermalcorrener: 0.314015 hartree
zpe.thermalcorrenthalpy: 0.314959 hartree
zpe.thermalcorrgfe: 0.238218 hartree
zpe.sumelectzpe: -1292.831667 hartree
zpe.sumelectthermal: -1292.810250 hartree
zpe.sumelectthermalent: -1292.809305 hartree
zpe.sumelectthermalfe: -1292.886047 hartree
dipole: 1.9384 6.7334 -1.1653
dipole: 7.1031
quadrupole: -119.6542 -116.3728 -130.3544
quadrupole: -37.3267 2.4301 1.6156
quadrupole: 2.4729 5.7543 -8.2272 -37.3267 2.4301 1.6156
hfenergy: -1293.1242649 hartree
pointgroup: C01 [X(C15H17N3O2S1)]
dipole: -1.7756738 -2.1550635 -0.1114144 debye
polarizability: 258.2669054|-26.7499358|263.8568265|-1.3057577|-4.2218315|166.5783195 unknown
InChI: InChI=1S/C15H17N3O2S/c1-12(11-13-5-3-2-4-6-13)17-18-21(19,20)15-9-7-14(16)8-10-15/h2-10,18H,11,16H2,1H3
charge 0 multiplicity 1
38 atoms
S  3.001666 0.846325 -0.19197
O  4.05938 1.067262 -1.411054
O  3.165347 1.611196 1.235546
N  1.330131 1.327793 -1.056715
N  0.298981 1.386494 -0.136388
N  2.270586 -5.05299 0.890233
C  -1.900756 2.043397 0.620901
C  2.757125 -0.961233 0.132146
C  -3.19908 1.431837 0.089627
C  -0.787128 2.083673 -0.411105
C  3.050376 -1.875274 -0.896572
C  2.30826 -1.360381 1.404284
C  -4.425291 2.13754 0.17122
C  -3.196758 0.134536 -0.486749
C  -0.972761 2.877816 -1.690135
C  2.431168 -3.696004 0.638741
C  2.888942 -3.246579 -0.639068
C  2.147078 -2.733016 1.655721
C  -5.6258 1.562039 -0.30675
C  -4.393126 -0.442582 -0.965978
C  -5.613259 0.269346 -0.87776
H  -1.527023 1.466597 1.486577
H  -2.104617 3.073813 0.974638
H  1.5603 2.184405 -1.61023
H  3.413442 -1.517213 -1.865253
H  2.107195 -0.61064 2.17554
H  -4.441982 3.140917 0.615363
H  -2.252221 -0.418704 -0.556094
H  -0.239108 3.708531 -1.760756
H  -0.824855 2.236429 -2.580649
H  -1.983328 3.311528 -1.743188
H  3.1181 -3.977521 -1.422982
H  1.799897 -3.068007 2.639855
H  -6.565886 2.120825 -0.234262
H  -4.376217 -1.445958 -1.406949
H  -6.541683 -0.178453 -1.249704
H  1.953267 -5.381793 1.79773
H  2.478737 -5.745152 0.176189
