program: Gaussian 09
title: 000227005
version: EM64L-G09RevD.01
frameworkgroup: C1[X(C15H17N3O2S)]
method: RPBEPBE
basis: SDD
operation: Freq
keyword: #p
keyword: freq=noraman
keyword: PBEPBE/SDD
title: #p freq=noraman PBEPBE/SDD
converged: YES YES NO NO
title: Mulliken charges:
elementType: S O O N N N C C C C C C C C C C C C C C C H H H H H H H H H H H H H H H H H
charge: 0.956220 -0.548018 -0.520267 -0.486634 -0.013365 -0.686697 0.092693 -0.081081 -0.505131 0.335463 -0.211867 -0.204250 -0.673830 -0.384474 -0.350426 0.513848 -0.386461 -0.385837 -0.246178 -0.228592 -0.236956 0.235937 0.207120 0.291177 0.276549 0.278002 0.244471 0.227770 0.222784 0.224462 0.274046 0.229888 0.230328 0.224620 0.226711 0.228605 0.314454 0.314915
chargesum: 0.00000
title: Mulliken charges with hydrogens summed into heavy atoms:
elementType: S O O N N N C C C C C C C C C C C C C C C
charge: 0.956220 -0.548018 -0.520267 -0.195457 -0.013365 -0.057328 0.092693 -0.081081 -0.062074 0.335463 0.064683 0.073752 0.021196 -0.160012 -0.076381 0.513848 -0.156573 -0.155509 -0.021557 -0.001881 -0.008351
polarizability: 3.39772253e+02 -1.51136227e+01 2.39925801e+02 6.45829914e+00 -1.28472183e+01 1.66992237e+02
1716.lowfreq: -8.7192 -4.3028 -0.0022 -0.0014 -0.0010 5.0121 11.1893 24.4438 30.4523
frequency: 9.6781 24.1387 30.3247 45.6195 49.8407 62.9127 84.2574 114.4697 124.2601 132.1766 160.8902 190.2544 215.4599 229.2191 247.1221 268.8198 283.0883 320.9172 325.3326 368.4442 392.9018 401.8067 403.1891 406.8775 407.8063 413.5311 428.7448 457.6410 484.6064 496.4653 522.1675 593.0443 603.9230 615.8688 622.8423 654.5188 696.1029 701.0082 720.5391 769.4842 777.1031 796.9480 809.4142 815.8995 831.7469 835.9342 850.4551 925.8719 934.3566 945.0863 954.8310 966.4251 979.8924 982.0104 987.0246 991.0822 1001.6548 1021.0412 1025.4246 1049.9819 1054.3756 1078.2914 1092.6649 1115.7285 1130.6098 1172.5600 1182.7867 1190.7882 1232.7422 1267.4449 1298.7659 1299.5615 1316.9391 1322.1265 1345.2367 1381.8461 1392.3749 1400.3082 1433.3833 1436.0468 1474.7906 1480.6541 1486.6455 1490.6398 1502.4683 1527.5816 1583.8173 1586.1808 1610.0941 1614.8165 1647.3605 2949.3799 2986.7249 3059.8919 3085.2607 3091.3626 3123.7956 3132.6353 3133.5429 3136.4993 3145.8946 3158.1405 3163.7026 3167.5646 3168.8396 3181.8109 3562.2571 3701.2856
redmass: 5.9764 4.0373 4.1144 3.6797 6.5414 3.2182 4.7290 5.0545 5.9518 6.5503 7.8758 5.8741 1.1251 7.7324 3.8478 4.9288 5.1875 4.8199 4.1307 3.9120 6.9663 3.5282 2.9975 2.2070 1.3063 2.9543 1.3505 4.2270 5.4330 3.3489 2.7944 2.9079 6.5309 5.9721 6.9057 4.5867 1.8908 3.1046 2.8998 1.4572 1.8066 6.1379 4.0240 1.2622 1.8858 1.9190 1.2586 1.4517 2.6806 9.8011 1.3631 1.3753 1.4545 4.2714 4.3950 2.7904 1.3457 1.4418 2.1862 2.5592 2.5281 1.7493 2.0272 2.0965 1.1918 1.0547 1.1160 1.1183 1.3469 1.1973 1.4558 1.2931 1.3737 2.6246 2.6629 7.1195 1.2055 5.4833 2.3615 3.8309 1.0406 1.5574 1.2417 2.9558 1.2336 7.0754 6.0080 7.3866 6.0559 4.7216 1.2322 1.0704 1.0350 1.0908 1.1005 1.1000 1.0845 1.0880 1.0893 1.0893 1.0930 1.0962 1.0955 1.0963 1.0998 1.0734 1.0452 1.1040
irintensity: 1.8492 0.4619 1.2331 0.9344 0.5046 0.0634 0.6947 3.7473 0.6287 0.3808 6.1898 5.0089 0.4061 17.4646 10.3958 14.3250 15.4850 9.5573 6.6286 1.9576 17.2808 26.1877 10.3691 38.7461 30.0048 0.0859 333.0163 57.0890 22.5955 19.0014 33.8310 39.1171 21.9487 2.9366 0.3473 2.9439 67.7377 68.8905 0.2952 99.4973 38.0519 96.4939 34.9000 0.7867 101.3214 142.5907 3.2144 2.1742 28.1953 42.9376 0.7524 0.4490 0.6683 4.5101 0.5726 3.2730 0.8784 1.4185 8.0369 18.3580 58.1938 2.7112 1.8973 8.3155 13.8045 0.3869 53.4159 2.5041 3.0103 8.9749 4.0741 4.5921 0.7461 76.5086 36.4606 0.4145 17.3408 4.5099 6.2917 2.1329 9.0102 12.6485 7.3771 72.2499 25.6643 26.4611 0.4083 7.1512 4.7979 176.3908 283.0796 32.5650 29.5351 11.5901 37.5915 37.5921 2.6639 3.7908 14.0553 14.2312 33.4551 31.2407 2.6315 10.7108 18.2283 10.7063 120.2382 25.0549
temp: 298.150 k
press: 1.00000 atm
elementType: 16 8 8 7 7 7 6 6 6 6 6 6 6 6 6 6 6 6 6 6 6 1 1 1 1 1 1 1 1 1 1 1 1 1 1 1 1 1
symmnumber: 1
zpe: 769561.9 jmol-1
zpe.correction: 0.293111 hartree
zpe.thermalcorrener: 0.314322 hartree
zpe.thermalcorrenthalpy: 0.315267 hartree
zpe.thermalcorrgfe: 0.239920 hartree
zpe.sumelectzpe: -1292.833865 hartree
zpe.sumelectthermal: -1292.812653 hartree
zpe.sumelectthermalent: -1292.811709 hartree
zpe.sumelectthermalfe: -1292.887055 hartree
dipole: 1.3021 4.4208 5.5189
dipole: 7.1901
quadrupole: -97.3306 -118.6250 -137.5207
quadrupole: 24.0179 12.8728 -8.6854
quadrupole: 20.4948 -0.7996 -19.6953 24.0179 12.8728 -8.6854
hfenergy: -1293.1269753 hartree
pointgroup: C01 [X(C15H17N3O2S1)]
dipole: 0.2838882 -2.2102498 -1.7424832 debye
polarizability: 341.8685768|0.476841|229.5756174|-9.1582091|-25.5720837|175.2460967 unknown
InChI: InChI=1S/C15H17N3O2S/c1-2-15(12-6-4-3-5-7-12)17-18-21(19,20)14-10-8-13(16)9-11-14/h3-11,18H,2,16H2,1H3
charge 0 multiplicity 1
38 atoms
S  1.75432 1.533245 0.850955
O  2.60322 2.862101 0.430975
O  1.161417 1.30459 2.349997
N  0.288572 1.612023 -0.476458
N  -0.77613 0.857929 -0.091988
N  4.801754 -3.429907 -0.761472
C  -2.009099 1.097713 -0.528993
C  2.678966 0.008274 0.348239
C  -2.308428 2.231975 -1.499891
C  -3.069978 0.163759 -0.072811
C  3.624339 0.106117 -0.68981
C  2.417105 -1.193825 1.030929
C  -1.909562 1.880568 -2.960312
C  -4.340653 0.115583 -0.711848
C  -2.832082 -0.707924 1.030313
C  4.097942 -2.290438 -0.393153
C  4.336791 -1.04689 -1.057273
C  3.131626 -2.344405 0.658357
C  -5.341163 -0.774567 -0.262709
C  -3.831651 -1.591864 1.477013
C  -5.093899 -1.630994 0.833408
H  -3.375223 2.506005 -1.449984
H  -1.750537 3.141381 -1.187021
H  0.164053 2.64248 -0.626629
H  3.808059 1.067734 -1.179448
H  1.684475 -1.215436 1.843648
H  -0.839665 1.613083 -3.021452
H  -2.495057 1.020866 -3.331658
H  -2.091307 2.738355 -3.63236
H  -4.552316 0.760857 -1.571389
H  -1.85635 -0.664138 1.523739
H  5.082947 -0.992753 -1.858259
H  2.945603 -3.291321 1.177878
H  -6.312147 -0.800069 -0.770052
H  -3.633993 -2.247351 2.332704
H  -5.872447 -2.317539 1.184302
H  5.493389 -3.399602 -1.5052
H  4.63981 -4.317715 -0.294584
