program: Gaussian 09
title: 000226994
version: EM64L-G09RevD.01
frameworkgroup: C1[X(C14H15N3O3S)]
method: RPBEPBE
basis: SDD
operation: Freq
keyword: #p
keyword: freq=noraman
keyword: PBEPBE/SDD
title: #p freq=noraman PBEPBE/SDD
converged: YES YES NO NO
title: Mulliken charges:
elementType: S O O O N N N C C C C C C C C C C C C C C H H H H H H H H H H H H H H H
charge: 0.954429 -0.543558 -0.519381 -0.260506 -0.479079 0.008603 -0.686867 -0.077646 -0.209252 -0.209542 0.514360 -0.385666 -0.388178 0.459704 -0.395528 -0.339939 -0.363732 0.327384 -0.348241 -0.343037 -0.537687 0.276561 0.281047 0.229859 0.230064 0.288490 0.223096 0.268697 0.211444 0.241219 0.250558 0.314581 0.314357 0.247011 0.223910 0.222465
chargesum: 0.00000
title: Mulliken charges with hydrogens summed into heavy atoms:
elementType: S O O O N N N C C C C C C C C C C C C C C
charge: 0.954429 -0.543558 -0.519381 -0.260506 -0.190588 0.008603 -0.057930 -0.077646 0.067308 0.071504 0.514360 -0.155807 -0.158114 0.459704 -0.172431 -0.071241 -0.152288 0.327384 -0.107022 -0.092479 0.155699
polarizability: 3.98414151e+02 8.58072443e+00 2.37642275e+02 1.26196962e+01 2.01790596e+01 1.44565430e+02
1716.lowfreq: -4.6953 -2.1605 0.0016 0.0017 0.0017 4.4385 10.0936 23.5213 26.6677
frequency: 9.8682 23.4797 26.6391 41.5993 54.6342 82.8183 107.7318 119.1853 133.3358 155.7061 175.2706 196.3411 211.3756 228.5717 231.9308 250.3304 285.8579 295.3879 335.0810 363.0446 390.6057 394.5444 404.8195 409.1714 413.0175 422.1141 423.7672 437.8067 466.5581 509.3874 521.8475 529.7570 586.5664 604.0643 622.7518 631.1128 719.9123 734.9984 736.4047 770.9117 801.5160 808.0720 815.1593 815.7134 834.6782 846.5244 862.5580 911.9133 944.9225 945.9991 954.4462 967.4172 982.4266 985.1212 985.2269 998.1870 1021.9118 1025.2911 1054.5584 1111.5701 1113.9218 1130.5603 1155.0103 1174.2682 1183.4104 1227.4627 1248.7091 1274.3033 1299.7486 1303.7273 1322.0061 1365.0031 1393.7458 1401.1102 1430.1357 1435.8700 1436.2774 1466.3167 1472.0996 1490.1178 1499.9429 1549.8254 1580.8158 1586.3568 1614.9018 1620.1367 1648.0054 2961.6422 2982.0970 3050.6712 3121.7356 3128.0077 3134.5472 3136.7025 3152.8854 3163.5104 3164.7232 3167.8768 3173.6599 3187.2314 3562.8817 3701.9842
redmass: 6.2427 3.6007 4.1662 5.4153 5.7850 5.5289 5.4493 4.4972 6.7745 9.2299 4.1133 2.6628 5.1669 3.2752 2.4701 2.6348 6.2207 5.0523 5.1585 5.8137 4.3061 9.9537 3.1309 1.0361 2.9207 2.9423 1.7438 3.0886 4.8676 3.4665 2.7425 2.6299 5.0725 6.0146 6.9107 7.0338 2.9013 3.6070 2.8009 2.6718 6.5274 1.3396 5.4687 1.3433 1.8471 1.4994 3.6776 1.4870 1.6382 7.1797 1.3630 1.3718 4.8509 4.1605 1.6186 2.6703 1.4466 4.2669 2.5612 1.2602 1.3304 1.1913 1.3266 1.2273 1.1181 2.3578 2.3580 1.2733 1.2920 1.2919 2.6219 3.2174 2.2336 5.5759 3.6787 1.2284 3.7589 1.0503 1.0757 2.9641 2.6386 6.5767 6.1894 7.4268 4.8063 6.2234 1.2277 1.0329 1.0870 1.1040 1.0892 1.0995 1.0893 1.0892 1.0878 1.0938 1.0954 1.0964 1.0974 1.0736 1.0452 1.1040
irintensity: 2.0326 3.4952 0.0909 0.3127 0.9354 2.4311 2.2692 3.7667 0.7960 9.7363 5.3214 12.0424 13.8666 16.9056 8.5804 2.8539 14.3094 38.2468 1.7817 45.1887 4.5860 54.6534 2.8715 1.1878 0.5134 11.3902 108.3424 318.2755 10.2630 69.0732 20.2392 31.2576 21.1206 17.9943 0.2367 11.0589 2.7055 1.8959 163.1436 206.3748 37.4109 22.2778 82.5156 11.6155 74.1257 47.3337 66.4843 25.6196 7.1946 62.2279 0.4622 0.4618 7.0475 52.2383 9.0371 6.1126 1.8572 4.2195 69.6281 0.1971 10.3048 12.9849 5.0317 150.9135 39.6119 142.9605 132.5515 33.1517 4.5528 14.4806 75.3114 18.5899 8.2969 3.5664 43.3441 3.2933 2.3893 13.9574 57.9854 72.6278 122.7747 26.3239 8.8297 8.0910 186.0764 161.1204 275.4614 99.6599 50.5854 46.6421 18.0110 21.4113 13.4587 15.2608 2.5712 23.0008 1.6072 10.9883 5.9325 19.3272 118.0745 25.0456
temp: 298.150 k
press: 1.00000 atm
elementType: 16 8 8 8 7 7 7 6 6 6 6 6 6 6 6 6 6 6 6 6 6 1 1 1 1 1 1 1 1 1 1 1 1 1 1 1
symmnumber: 1
zpe: 705470.5 jmol-1
zpe.correction: 0.268700 hartree
zpe.thermalcorrener: 0.289750 hartree
zpe.thermalcorrenthalpy: 0.290694 hartree
zpe.thermalcorrgfe: 0.215719 hartree
zpe.sumelectzpe: -1328.734772 hartree
zpe.sumelectthermal: -1328.713722 hartree
zpe.sumelectthermalent: -1328.712778 hartree
zpe.sumelectthermalfe: -1328.787753 hartree
dipole: 2.2475 5.8130 -3.6749
dipole: 7.2351
quadrupole: -87.3299 -116.8442 -134.6326
quadrupole: -37.3932 5.5574 9.4480
quadrupole: 25.6057 -3.9086 -21.6970 -37.3932 5.5574 9.4480
hfenergy: -1329.0034716 hartree
pointgroup: C01 [X(C14H15N3O3S1)]
dipole: 0.9546049 2.3812907 -1.2332226 debye
polarizability: 399.1029258|1.6176218|232.5964689|10.7286175|28.190496|148.9224616 unknown
InChI: InChI=1S/C14H15N3O3S/c1-20-13-6-2-11(3-7-13)10-16-17-21(18,19)14-8-4-12(15)5-9-14/h2-10,17H,15H2,1H3
charge 0 multiplicity 1
36 atoms
S  -2.52822 -1.811515 0.347451
O  -3.572984 -2.87669 -0.307746
O  -1.937431 -1.995705 1.853612
O  5.936513 1.281852 0.503966
N  -1.094739 -1.841794 -0.989953
N  0.02786 -1.186032 -0.561576
N  -4.693989 3.805723 -0.160175
C  -3.17681 -0.084494 0.177667
C  -4.092442 0.193188 -0.854207
C  -2.748197 0.886462 1.100977
C  -4.189858 2.516198 -0.048134
C  -4.600917 1.497575 -0.963484
C  -3.260275 2.189485 0.987046
C  2.433675 -0.829267 -0.615051
C  3.694743 -1.272795 -1.094226
C  2.394179 0.323894 0.227155
C  1.223204 -1.56323 -0.983212
C  4.826335 0.534403 0.09116
C  4.888773 -0.605229 -0.749211
C  3.571324 0.995756 0.576445
C  7.258668 0.845446 0.045969
H  -4.409173 -0.598811 -1.540148
H  -2.045335 0.615385 1.894839
H  -5.319482 1.736345 -1.755843
H  -2.943678 2.962065 1.697068
H  -1.016124 -2.85091 -1.265185
H  3.744891 -2.155026 -1.744806
H  1.422455 0.668583 0.593989
H  1.349316 -2.435503 -1.656027
H  5.844044 -0.974622 -1.133401
H  3.556322 1.878708 1.222671
H  -4.410737 4.535556 0.487496
H  -5.358322 4.045383 -0.890664
H  7.966159 1.561524 0.48859
H  7.489005 -0.17711 0.402731
H  7.333247 0.880201 -1.058282
