program: Gaussian 09
title: 000226990
version: EM64L-G09RevD.01
frameworkgroup: C1[X(C13H21N3O2S)]
method: RPBEPBE
basis: SDD
operation: Freq
keyword: #p
keyword: freq=noraman
keyword: PBEPBE/SDD
title: #p freq=noraman PBEPBE/SDD
converged: YES YES NO NO
title: Mulliken charges:
elementType: S O O N N N C C C C C C C C C C C C C H H H H H H H H H H H H H H H H H H H H H
charge: 0.989302 -0.508307 -0.553693 -0.008427 -0.466110 -0.693855 -0.369878 -0.330074 -0.502802 -0.345962 0.169814 -0.698210 -0.799569 -0.123579 -0.178883 -0.232900 -0.405045 -0.390325 0.526507 0.193350 0.203949 0.189864 0.201398 0.212226 0.228436 0.190902 0.191931 0.212777 0.212127 0.208854 0.228805 0.260568 0.243914 0.290327 0.281750 0.281133 0.231028 0.230800 0.313215 0.314644
chargesum: 0.00000
title: Mulliken charges with hydrogens summed into heavy atoms:
elementType: S O O N N N C C C C C C C C C C C C C
charge: 0.989302 -0.508307 -0.553693 -0.008427 -0.175783 -0.065996 0.027421 0.061188 -0.062141 0.036871 0.169814 -0.064452 -0.066283 -0.123579 0.102868 0.048232 -0.174017 -0.159526 0.526507
polarizability: 2.21564090e+02 -1.93441125e+01 2.19307709e+02 7.83714259e+00 3.16792115e-01 1.69362530e+02
1716.lowfreq: -6.4242 -5.2595 -0.0008 -0.0005 0.0010 5.6671 17.1338 35.9173 38.7475
frequency: 16.8012 35.9054 38.5525 39.9165 52.3618 59.5983 77.8007 97.2659 110.1541 130.2322 138.3981 149.9424 152.3974 189.8058 214.9188 224.3691 231.7756 242.4611 278.8110 304.6421 328.7719 354.8652 377.9577 389.2000 400.6474 412.2131 414.1254 417.1740 432.4187 446.1161 468.3070 517.7593 524.8449 576.2856 601.4675 622.5943 699.5300 716.9490 726.6304 782.7433 802.6435 814.7948 816.1794 819.2967 832.6254 841.3032 909.3415 914.9400 945.7746 951.7387 963.3919 971.6944 981.9889 984.8415 1015.4213 1022.1821 1025.6126 1047.5419 1050.5782 1080.0540 1105.1282 1123.2072 1129.6674 1182.6839 1197.3530 1212.0556 1259.3731 1273.8998 1279.2417 1284.9124 1288.4645 1299.2561 1320.0051 1323.6312 1337.5741 1358.1649 1387.2674 1388.9962 1399.6608 1433.6106 1452.2236 1460.1252 1463.4611 1467.2986 1470.8575 1475.8824 1478.6988 1487.0779 1488.5594 1585.1104 1588.7297 1613.2018 1648.1511 2953.0797 2958.9400 2959.6957 2967.9825 2970.3099 2976.1193 2996.7519 3011.1150 3028.4513 3036.7906 3061.3200 3064.3157 3067.9636 3102.3179 3131.2903 3134.0868 3156.6759 3171.4922 3242.0696 3561.5094 3700.4709
redmass: 4.5266 5.2965 3.5422 4.1296 1.5927 3.0697 4.8420 4.9772 2.2512 4.6481 1.5765 3.2654 3.3143 3.0471 3.6810 3.4266 1.8489 2.1872 6.3561 4.7508 5.1491 3.3752 3.4126 2.3855 3.0697 2.8051 1.0560 2.5199 1.6546 4.5411 5.6549 2.8543 2.7242 2.3954 6.7332 6.9121 2.2228 2.8663 1.1789 1.3709 5.9825 3.8029 1.2801 3.0069 1.8540 1.6641 1.8172 1.5281 2.4209 1.4372 1.3979 3.6058 4.7835 1.9908 1.6383 1.4618 1.7453 2.7747 2.5195 2.2470 1.9213 2.1032 1.1972 1.1162 1.4745 1.3608 1.6806 1.3200 1.2750 1.2469 1.1545 1.2945 2.5716 1.4693 1.5828 1.6319 1.2134 1.2153 5.5120 3.7667 1.1045 1.0668 1.0670 1.0742 1.0733 1.0440 1.0719 1.0853 2.9104 7.3788 8.0460 4.9240 1.2161 1.0422 1.0598 1.0583 1.0384 1.0587 1.0639 1.0972 1.1013 1.0930 1.1035 1.0979 1.1003 1.0995 1.0971 1.0888 1.0896 1.0961 1.0957 1.0741 1.0452 1.1040
irintensity: 2.3200 1.3616 0.2889 0.1251 0.1769 1.4485 0.4641 0.1927 1.2494 0.5853 0.7629 2.4236 0.4889 4.5364 1.1325 4.9041 4.2879 0.9171 19.8696 4.5588 1.3932 10.1745 1.5875 0.3719 0.9945 0.1202 3.4554 9.9910 365.7158 113.2675 63.3709 31.3773 9.7964 36.9519 29.3873 0.5238 35.2457 0.1205 16.4022 10.7286 25.1086 129.8918 1.9025 27.0562 81.9774 2.0196 6.0177 1.2691 30.6595 9.4165 3.4100 38.7218 6.1729 5.2518 3.9610 2.4139 2.7418 0.7853 47.7089 1.4172 2.3515 14.4587 12.9388 34.9960 2.3673 3.2260 5.2444 0.4150 1.9056 7.6245 1.2265 4.7181 67.4027 0.4845 3.4738 0.5858 35.7776 7.7591 5.3387 2.1428 15.9007 8.8431 17.5687 9.6591 4.2651 13.2180 10.6252 25.3996 54.5955 7.1006 16.1890 155.4143 237.3255 14.0946 8.7467 4.1472 23.4133 74.4131 85.4088 5.5462 5.4128 18.4195 49.5505 10.0949 100.7672 69.3215 18.8348 11.4586 12.9781 7.6099 5.0123 5.3557 102.7708 24.5409
temp: 298.150 k
press: 1.00000 atm
elementType: 16 8 8 7 7 7 6 6 6 6 6 6 6 6 6 6 6 6 6 1 1 1 1 1 1 1 1 1 1 1 1 1 1 1 1 1 1 1 1 1
symmnumber: 1
zpe: 851172.5 jmol-1
zpe.correction: 0.324194 hartree
zpe.thermalcorrener: 0.346516 hartree
zpe.thermalcorrenthalpy: 0.347460 hartree
zpe.thermalcorrgfe: 0.270804 hartree
zpe.sumelectzpe: -1219.076484 hartree
zpe.sumelectthermal: -1219.054163 hartree
zpe.sumelectthermalent: -1219.053219 hartree
zpe.sumelectthermalfe: -1219.129875 hartree
dipole: 9.6094 -1.7274 -0.6692
dipole: 9.7864
quadrupole: -148.2780 -98.3276 -119.1948
quadrupole: -10.4765 3.2923 -5.4584
quadrupole: -26.3445 23.6059 2.7387 -10.4765 3.2923 -5.4584
hfenergy: -1219.4006789 hartree
pointgroup: C01 [X(C13H21N3O2S1)]
dipole: -2.0052717 -3.2808617 0.1981164 debye
polarizability: 201.2187229|-1.1586246|239.4195738|5.030717|7.5760656|169.5960328 unknown
InChI: InChI=1S/C13H21N3O2S/c1-3-4-5-6-11(2)15-16-19(17,18)13-9-7-12(14)8-10-13/h7-10,16H,3-6,14H2,1-2H3
charge 0 multiplicity 1
40 atoms
S  1.90273 2.094765 0.239189
O  2.495757 2.757194 -1.111146
O  2.494685 2.422625 1.723854
N  -0.778851 1.969252 -0.402617
N  0.065971 2.696469 0.41594
N  1.619115 -3.90949 -0.501639
C  -3.593812 -0.076123 -0.465385
C  -2.560218 -1.145328 -0.046127
C  -2.951625 1.179418 -1.125428
C  -3.208105 -2.408554 0.564668
C  -2.078828 1.973657 -0.175533
C  -2.166075 -3.460251 1.004985
C  -2.711332 2.738251 0.974053
C  1.818906 0.246876 0.006221
C  1.679135 -0.267138 -1.296712
C  1.900743 -0.576305 1.144734
C  1.617274 -1.660454 -1.463288
C  1.837819 -1.969394 0.972603
C  1.688064 -2.531852 -0.332741
H  -4.19298 0.228038 0.41822
H  -4.309897 -0.519807 -1.186752
H  -1.952012 -1.432308 -0.928915
H  -1.845097 -0.710701 0.68122
H  -3.759141 1.834975 -1.510847
H  -2.332125 0.866646 -1.985198
H  -3.83097 -2.116505 1.43521
H  -3.90177 -2.858713 -0.17501
H  -2.650254 -4.358664 1.430768
H  -1.540813 -3.779881 0.14949
H  -1.486523 -3.041894 1.772026
H  -2.409803 2.328272 1.961393
H  -2.390597 3.798384 0.955144
H  -3.810931 2.70116 0.92214
H  -0.098489 2.696858 1.447353
H  1.634231 0.410933 -2.153988
H  2.040192 -0.131442 2.135836
H  1.511657 -2.08289 -2.469235
H  1.91263 -2.62942 1.844558
H  1.543484 -4.318827 -1.428597
H  1.678053 -4.537332 0.29515
