program: Gaussian 09
title: 000226984
version: EM64L-G09RevD.01
frameworkgroup: C1[X(C13H13N3O2S)]
method: RPBEPBE
basis: SDD
operation: Freq
keyword: #p
keyword: freq=noraman
keyword: PBEPBE/SDD
title: #p freq=noraman PBEPBE/SDD
converged: YES YES NO NO
title: Mulliken charges:
elementType: S O O N N N C C C C C C C C C C C C C H H H H H H H H H H H H H
charge: 0.961269 -0.540792 -0.515815 -0.491672 0.023729 -0.685824 -0.072824 -0.209577 -0.212743 0.514493 -0.384801 -0.387035 0.442230 -0.353965 -0.386126 -0.356912 -0.221220 -0.217268 -0.235897 0.276660 0.281615 0.230854 0.230793 0.295567 0.212125 0.224071 0.265205 0.315369 0.315303 0.227766 0.226011 0.229409
chargesum: 0.00000
title: Mulliken charges with hydrogens summed into heavy atoms:
elementType: S O O N N N C C C C C C C C C C C C C
charge: 0.961269 -0.540792 -0.515815 -0.196105 0.023729 -0.055152 -0.072824 0.067083 0.068872 0.514493 -0.153946 -0.156243 0.442230 -0.141840 -0.162055 -0.091708 0.006546 0.008743 -0.006488
polarizability: 3.23182407e+02 7.09687086e+00 2.21655725e+02 9.43501728e+00 2.45392229e+01 1.38178814e+02
1716.lowfreq: -7.1442 -2.6792 -0.0015 0.0011 0.0016 3.4370 13.3428 25.1539 27.0977
frequency: 12.9091 25.0660 26.9268 52.5240 69.5170 109.6512 121.4411 133.3750 166.2589 196.5811 219.5654 231.8743 262.4384 291.2980 311.5973 343.3273 387.9765 397.6444 402.9267 404.6787 413.3608 415.0382 433.4481 452.4680 496.1470 514.0884 521.9856 603.4226 614.8501 622.4996 636.2257 697.6792 719.2949 738.7819 769.8927 802.4618 815.6653 817.1546 835.6977 852.3755 860.1999 907.4680 939.4710 948.9650 955.6804 969.6491 981.9169 982.7620 987.1148 1000.5622 1020.7739 1022.1788 1034.3030 1054.2666 1085.9514 1132.4300 1172.1419 1182.2863 1184.9495 1238.6113 1273.4218 1301.1146 1320.6898 1323.6966 1373.4892 1397.6710 1400.3494 1436.2321 1438.1687 1483.1475 1491.2623 1554.5078 1586.1546 1588.9038 1611.4593 1614.7735 1648.4564 2990.2683 3117.1946 3128.8081 3134.9881 3137.1383 3142.3290 3157.4804 3164.2799 3167.7259 3168.4090 3214.5862 3561.7993 3700.6797
redmass: 6.1084 3.8415 3.7859 7.3928 5.4988 5.7250 5.6625 7.2980 8.6316 8.2628 3.4859 7.7488 4.4593 6.4039 5.3804 4.8815 5.6448 10.2399 3.2960 2.9266 1.0935 2.4457 1.3688 5.1269 3.0414 3.4536 2.8225 6.0798 6.4548 6.8968 4.6336 1.7517 2.8834 2.0308 1.7501 6.8265 5.5457 1.3525 1.8387 1.2592 3.5990 1.4111 1.5824 12.4569 1.3621 1.3720 4.7774 1.3835 6.2004 1.3329 2.5980 1.4499 3.2807 2.5907 1.6216 1.1948 1.0599 1.1115 1.1157 1.8952 1.2357 1.2940 1.3902 2.4886 2.6246 3.0614 5.2569 3.8531 2.3514 2.4623 2.9400 6.2161 7.3401 5.7831 6.0888 4.7592 1.2286 1.0873 1.0872 1.0868 1.0894 1.0892 1.0922 1.0960 1.0957 1.0965 1.1002 1.0740 1.0453 1.1040
irintensity: 1.8722 0.8471 0.1722 0.4824 1.5370 0.8710 3.6790 0.6002 9.2867 4.1653 24.5632 11.2495 4.5318 24.6555 14.9142 4.9549 34.8458 78.2977 2.2443 0.5972 0.1116 0.0547 231.1239 183.9999 68.1419 31.0575 30.2044 12.0716 0.7959 0.2479 2.4211 50.9027 9.6022 367.0511 45.7730 37.4709 80.8667 12.1764 74.7160 1.0596 53.0976 12.1096 20.8637 62.6194 0.4525 0.6204 6.3360 0.0398 0.2551 0.5663 9.6876 2.2816 5.3956 65.1826 8.1032 12.9822 0.6728 15.6415 36.4888 6.2046 28.7229 4.8237 15.9403 63.8472 13.7905 8.3452 3.0340 1.8211 6.8262 9.8884 67.3239 3.4289 7.6718 0.0566 2.4811 179.0455 275.5677 46.8632 8.5898 0.1223 12.2692 14.4518 25.3470 32.2461 2.0110 10.5194 21.6044 4.1690 118.8265 25.5368
temp: 298.150 k
press: 1.00000 atm
elementType: 16 8 8 7 7 7 6 6 6 6 6 6 6 6 6 6 6 6 6 1 1 1 1 1 1 1 1 1 1 1 1 1
symmnumber: 1
zpe: 623439.7 jmol-1
zpe.correction: 0.237456 hartree
zpe.thermalcorrener: 0.255773 hartree
zpe.thermalcorrenthalpy: 0.256717 hartree
zpe.thermalcorrgfe: 0.188148 hartree
zpe.sumelectzpe: -1214.381740 hartree
zpe.sumelectthermal: -1214.363423 hartree
zpe.sumelectthermalent: -1214.362479 hartree
zpe.sumelectthermalfe: -1214.431049 hartree
dipole: -0.8276 6.5605 -2.9691
dipole: 7.2485
quadrupole: -90.1657 -108.6633 -120.6484
quadrupole: -27.9749 4.8586 11.7250
quadrupole: 16.3268 -2.1708 -14.1559 -27.9749 4.8586 11.7250
hfenergy: -1214.6191961 hartree
pointgroup: C01 [X(C13H13N3O2S1)]
dipole: 0.1547079 2.6979277 0.9110168 debye
polarizability: 323.6860739|0.7175657|215.7838961|10.9264639|-31.4143821|143.5469754 unknown
InChI: InChI=1S/C13H13N3O2S/c14-12-6-8-13(9-7-12)19(17,18)16-15-10-11-4-2-1-3-5-11/h1-10,16H,14H2
charge 0 multiplicity 1
32 atoms
S  1.661589 -1.939556 -0.261518
O  2.548385 -3.07175 0.502124
O  1.14406 -2.134691 -1.791558
N  0.16241 -1.782517 0.972799
N  -0.85942 -1.028651 0.478526
N  4.31459 3.469503 0.178233
C  2.459462 -0.274861 -0.115242
C  3.319244 -0.033269 0.972512
C  2.197533 0.684587 -1.110294
C  3.699465 2.228493 0.080142
C  3.941279 1.221983 1.066714
C  2.822887 1.938369 -1.010794
C  -3.197898 -0.356964 0.434478
C  -2.099636 -1.214687 0.893323
C  -4.515888 -0.608588 0.908521
C  -2.985986 0.716537 -0.478383
C  -5.598153 0.188451 0.478718
C  -4.068391 1.508814 -0.904606
C  -5.379236 1.250084 -0.429347
H  3.507869 -0.816102 1.713946
H  1.534309 0.442098 -1.946467
H  4.618524 1.431058 1.902613
H  2.635795 2.700704 -1.775678
H  -0.021885 -2.755191 1.312624
H  -2.353006 -2.009894 1.622355
H  -4.689134 -1.431869 1.613218
H  -1.968763 0.905474 -0.835822
H  4.151029 4.190575 -0.518718
H  4.94222 3.682402 0.94845
H  -6.608368 -0.016792 0.84985
H  -3.897261 2.331311 -1.608308
H  -6.218326 1.870339 -0.763611
