program: Gaussian 09
title: 000226972
version: EM64L-G09RevD.01
frameworkgroup: C1[X(C9H13N3O2S)]
method: RPBEPBE
basis: SDD
operation: Freq
keyword: #p
keyword: freq=noraman
keyword: PBEPBE/SDD
title: #p freq=noraman PBEPBE/SDD
converged: YES YES NO NO
title: Mulliken charges:
elementType: S O O N N N C C C C C C C C C H H H H H H H H H H H H H
charge: 0.994825 -0.555335 -0.507983 -0.480318 -0.007975 -0.687363 -0.119750 -0.180810 -0.228827 0.512300 -0.399496 -0.386062 0.193804 -0.752252 -0.778109 0.281802 0.281591 0.230076 0.229763 0.294637 0.230098 0.223095 0.250731 0.229326 0.242573 0.261134 0.313845 0.314678
chargesum: 0.00000
title: Mulliken charges with hydrogens summed into heavy atoms:
elementType: S O O N N N C C C C C C C C C
charge: 0.994825 -0.555335 -0.507983 -0.185681 -0.007975 -0.058840 -0.119750 0.100992 0.052764 0.512300 -0.169420 -0.156298 0.193804 -0.048327 -0.045076
polarizability: 2.01816603e+02 1.23560215e+01 1.58628712e+02 -2.47543878e+00 8.48383700e+00 1.32450039e+02
1716.lowfreq: -9.5075 -4.9580 0.0013 0.0016 0.0023 8.9572 24.3636 33.5349 44.9052
frequency: 24.0765 33.4580 44.7963 70.7445 95.7206 123.1588 136.8671 143.4668 173.4940 196.2995 221.2472 231.8221 275.8753 310.1251 329.7129 342.9208 372.3569 399.1588 408.7459 412.2498 417.9721 431.9853 449.7043 490.2314 517.3116 543.6860 600.6801 622.6866 712.0009 719.8271 802.6503 813.1648 816.1106 821.2989 831.2027 945.8070 949.6758 956.0616 960.9689 962.8422 976.9105 981.9777 1021.7731 1049.9386 1075.5571 1107.5367 1130.0347 1183.3436 1270.7197 1295.4004 1299.6047 1321.2077 1384.2837 1394.8114 1399.3336 1434.1868 1453.5488 1459.9973 1465.3990 1469.7317 1488.4978 1584.4521 1602.8950 1613.9938 1647.7632 2954.3249 2968.7840 3030.0869 3041.3446 3103.6066 3112.4712 3132.4679 3135.9242 3158.1017 3172.7905 3266.1887 3562.4513 3701.4093
redmass: 3.9198 4.1101 2.8500 3.8132 5.3837 1.4167 3.7234 4.5556 1.3895 2.8178 6.1568 7.1595 5.7582 4.1772 4.8832 2.5596 2.8738 3.1641 1.0178 2.9382 2.6749 1.7490 6.7572 3.3014 2.7524 2.6613 7.0170 6.9100 2.9027 3.1775 5.8631 1.2735 6.6372 2.9848 1.9043 2.2445 1.6422 1.2921 1.5649 1.4124 3.6978 4.7332 1.4552 2.5196 1.6240 2.2756 1.1957 1.1159 1.7482 1.9320 1.3042 2.6035 1.2514 1.2509 5.4987 3.7723 1.0983 1.0482 1.0507 1.0691 2.9505 7.3810 6.6051 4.8122 1.2244 1.0415 1.0382 1.0935 1.0972 1.0975 1.0975 1.0887 1.0897 1.0961 1.0957 1.0745 1.0452 1.1040
irintensity: 0.2846 1.3242 2.1145 0.3821 0.2634 1.0197 1.1680 3.3689 1.1220 0.8725 5.8956 8.0974 19.2182 5.0324 0.8155 14.3968 6.9005 3.3138 0.0621 0.0112 13.7567 340.7999 180.5062 3.3567 35.9499 36.3537 24.7637 0.6535 29.0846 23.7953 22.9183 0.6436 126.9780 14.1510 71.2007 15.8294 12.7260 2.3611 17.3120 3.3175 35.9771 4.7670 2.5547 53.5604 4.1848 22.0456 13.8174 39.1349 5.1375 8.8512 6.7622 74.9144 50.2123 7.5874 5.3710 1.9666 28.0403 21.4761 14.3515 5.6690 64.9607 7.7751 18.3550 170.1759 262.8438 15.0505 35.8660 18.3980 23.2500 15.2935 19.1654 12.7349 14.3475 8.5119 5.0863 6.3564 108.6944 25.1784
temp: 298.150 k
press: 1.00000 atm
elementType: 16 8 8 7 7 7 6 6 6 6 6 6 6 6 6 1 1 1 1 1 1 1 1 1 1 1 1 1
symmnumber: 1
zpe: 557250.5 jmol-1
zpe.correction: 0.212246 hartree
zpe.thermalcorrener: 0.229233 hartree
zpe.thermalcorrenthalpy: 0.230177 hartree
zpe.thermalcorrgfe: 0.166398 hartree
zpe.sumelectzpe: -1062.184717 hartree
zpe.sumelectthermal: -1062.167730 hartree
zpe.sumelectthermalent: -1062.166786 hartree
zpe.sumelectthermalfe: -1062.230564 hartree
dipole: 3.7911 8.1357 -3.0703
dipole: 9.4863
quadrupole: -66.0569 -106.7883 -94.5734
quadrupole: 2.5069 3.4412 4.1941
quadrupole: 23.0826 -17.6487 -5.4339 2.5069 3.4412 4.1941
hfenergy: -1062.3969626 hartree
pointgroup: C01 [X(C9H13N3O2S1)]
dipole: -1.3440416 -3.2764788 -1.1779133 debye
polarizability: 200.4079835|14.4488259|160.1981196|1.000414|-8.6830114|132.2892504 unknown
InChI: InChI=1S/C9H13N3O2S/c1-7(2)11-12-15(13,14)9-5-3-8(10)4-6-9/h3-6,12H,10H2,1-2H3
charge 0 multiplicity 1
28 atoms
S  0.552178 1.892769 0.211236
O  0.464229 2.96311 -1.016541
O  0.728759 2.332405 1.756945
N  2.135785 0.910015 -0.267929
N  2.136594 -0.371192 0.255169
N  -4.174015 -1.876697 -0.154754
C  -0.89005 0.716141 0.095905
C  -1.207737 -0.078711 1.213689
C  -1.629626 0.678816 -1.100974
C  -3.08501 -1.017666 -0.072286
C  -2.309067 -0.94613 1.12616
C  -2.731685 -0.188847 -1.18197
C  3.019877 -1.24583 -0.185564
C  3.02817 -2.611303 0.459066
C  4.030492 -0.922773 -1.271679
H  -0.613711 -0.003748 2.129128
H  -1.361795 1.337853 -1.933641
H  -2.576791 -1.572949 1.984525
H  -3.32983 -0.224506 -2.099811
H  2.237357 1.050517 -1.296033
H  4.006044 -2.814868 0.937721
H  2.865923 -3.406829 -0.294376
H  2.238281 -2.677196 1.223728
H  3.539228 -0.743979 -2.25146
H  4.749825 -1.745771 -1.406317
H  4.587737 0.00064 -1.018116
H  -4.740621 -1.92328 -0.996879
H  -4.441441 -2.45809 0.634457
