program: Gaussian 09
title: 000226967
version: EM64L-G09RevD.01
frameworkgroup: C1[X(C24H30O4)]
method: RPBEPBE
basis: SDD
operation: Freq
keyword: #pfreq=noraman
keyword: PBEPBE/SDD
title: #p freq=noraman PBEPBE/SDD
converged: YES YES NO NO
title: Mulliken charges:
elementType: O O O O C C C C C C C C C C C C C C C C C C C C C C C C H H H H H H H H H H H H H H H H H H H H H H H H H H H H H H
charge: -0.303820 -0.303818 -0.225692 -0.225689 -0.412702 -0.412705 -0.229531 -0.229530 0.562155 0.562147 -0.727764 -0.727765 -0.405353 -0.405333 -0.457507 -0.457502 -0.366733 -0.366747 -0.387465 -0.387470 0.375795 0.375799 0.247368 0.247361 -0.476966 -0.476949 -0.659675 -0.659678 0.198387 0.217012 0.198390 0.217007 0.203320 0.203321 0.216547 0.211347 0.226767 0.211348 0.216548 0.226767 0.240741 0.240746 0.235127 0.235128 0.309476 0.309464 0.246195 0.246201 0.246950 0.244431 0.244410 0.246977 0.224147 0.216709 0.230722 0.224153 0.216710 0.230720
chargesum: 0.00000
title: Mulliken charges with hydrogens summed into heavy atoms:
elementType: O O O O C C C C C C C C C C C C C C C C C C C C C C C C
charge: -0.303820 -0.303818 -0.225692 -0.225689 0.002697 0.002693 -0.026212 -0.026209 0.562155 0.562147 -0.073104 -0.073102 -0.164611 -0.164587 -0.222379 -0.222374 -0.057257 -0.057283 -0.141271 -0.141269 0.375795 0.375799 0.247368 0.247361 0.014415 0.014438 0.011903 0.011905
polarizability: 3.40792557e+02 -4.81068481e-03 2.55432738e+02 2.10270649e-03 -1.66249452e+01 2.05779298e+02
1716.lowfreq: -7.6747 -3.3138 -2.8707 -0.0009 -0.0008 0.0003 11.3266 28.0196 31.4186
frequency: 11.3131 27.9324 31.2955 32.1935 36.1631 43.0634 49.8647 55.8527 64.0781 64.7446 72.4253 76.8317 87.1798 113.9024 122.9021 146.2642 181.5929 187.8693 196.2352 197.9002 208.2390 215.4570 218.6165 230.1845 236.3119 258.3223 267.5053 281.9869 315.3325 321.1567 359.0771 375.1443 394.1878 410.0520 416.0228 417.8375 427.8195 477.3278 496.4829 535.3846 535.8179 543.2231 545.7198 550.2909 559.5259 627.3498 627.4212 640.3863 640.6244 686.8148 697.8101 733.5246 736.9670 781.6651 787.1178 791.2735 792.1555 805.0169 830.5824 832.3566 839.3206 839.8278 861.8351 865.4143 891.6381 896.5689 947.4804 952.6783 952.9264 979.5089 981.4110 990.2085 1006.4662 1007.7958 1009.7923 1011.0365 1032.6872 1040.5849 1059.0293 1070.2178 1070.2304 1083.0723 1085.0587 1085.0879 1104.4661 1105.8377 1108.8292 1111.6155 1117.5312 1123.6870 1161.0551 1163.4903 1170.2414 1190.5049 1192.4561 1202.5676 1210.8471 1242.7217 1242.7622 1258.2470 1262.2290 1291.0734 1300.4187 1300.5310 1322.9692 1330.1753 1330.8926 1336.9700 1336.9851 1347.2944 1384.1570 1385.0531 1388.0393 1389.4588 1397.9479 1398.6390 1411.0819 1411.2909 1441.9107 1441.9952 1463.9807 1468.7436 1471.0287 1472.4982 1472.5777 1473.6756 1477.0413 1479.1998 1480.5566 1480.7042 1493.8678 1493.9183 1593.8597 1594.1762 1610.3727 1611.2523 1659.6462 1663.2430 2963.8934 2965.5326 2971.5268 2972.2828 2974.6210 2975.3505 2997.1632 2997.5456 3000.7821 3000.8528 3018.0498 3039.0137 3046.7491 3046.8120 3067.3837 3067.8508 3077.2825 3077.3350 3095.2083 3095.6638 3101.0526 3101.3146 3122.0490 3122.1364 3134.2430 3134.6620 3161.8709 3161.9504 3168.0548 3168.1234
redmass: 3.6327 3.8197 2.1840 2.7419 5.0027 3.7466 4.9379 2.7898 4.4393 6.6041 4.5702 4.3885 4.7866 2.7161 4.1265 3.7256 2.6803 1.8120 1.3157 1.4331 1.5791 3.0096 1.5909 1.7527 1.9783 3.0990 3.7451 3.8762 3.5097 5.0516 3.9657 4.9628 4.1671 3.6178 2.9888 3.3192 4.2393 3.8099 3.2193 2.8076 2.8079 3.0835 3.0154 3.1068 2.8028 5.6841 4.9621 4.5888 4.4393 2.9544 3.8633 3.1957 3.7063 2.7666 2.7951 1.3656 1.6690 1.8998 1.9696 2.4465 1.6068 1.5289 2.1425 1.9343 2.1074 1.6687 1.4808 1.4136 1.3799 1.3900 1.5527 1.8003 2.7088 2.4767 2.0620 1.9713 1.7557 2.3525 1.9632 2.9235 2.9459 1.8512 1.6179 1.6213 2.4574 1.7552 2.8898 2.5301 1.4127 1.9837 2.6321 2.4799 1.5429 1.2984 1.2773 1.9504 2.1534 1.1743 1.1743 1.2889 1.3710 1.3512 1.3179 1.3046 1.3474 1.5818 1.7110 1.7723 1.7610 1.4273 1.5775 1.9653 2.4816 1.9385 1.2144 1.2152 2.5623 2.5384 1.0856 1.0832 1.0681 1.0648 1.0395 1.0407 1.0505 1.0813 1.0985 1.0850 1.0517 1.0536 2.2847 2.2670 7.1905 7.2001 6.4600 6.3864 9.9819 9.9791 1.0799 1.0831 1.0491 1.0427 1.0470 1.0569 1.0374 1.0382 1.0600 1.0592 1.0978 1.1035 1.0985 1.0985 1.0997 1.0996 1.0998 1.0997 1.1004 1.1004 1.1003 1.1003 1.0892 1.0892 1.0895 1.0896 1.0952 1.0952 1.0963 1.0963
irintensity: 0.0041 0.5407 0.0057 0.0794 0.2311 0.4310 0.0001 7.0634 0.7417 0.4300 0.0084 0.0694 1.7791 0.0403 0.0506 0.1885 0.0480 0.4127 0.0166 1.3690 0.0562 1.8115 0.7961 0.1867 0.1268 8.0206 1.3774 4.8066 4.4892 2.1002 2.8885 10.6178 1.9499 0.8299 0.0371 0.6049 0.4671 0.4631 2.5656 5.2138 2.2922 0.2725 38.7751 16.9075 0.4730 2.1841 0.0024 0.3559 4.7470 9.1261 3.0837 0.1760 1.2852 0.1851 1.6000 3.6086 26.9710 1.0251 25.9445 18.7542 0.3201 4.6114 123.6734 0.0017 3.5696 0.1914 0.1624 1.7095 1.0693 5.4365 39.6361 17.0481 1.2919 1.9641 22.2818 90.6877 0.6674 4.8408 16.0460 233.6242 92.1056 1.6139 0.5804 0.9513 22.7282 88.7672 114.7113 400.0094 15.8210 9.6482 18.7901 165.6048 13.6288 2.1731 6.8991 6.7783 17.1698 0.0095 0.2389 1.0177 1.1563 0.0670 2.4826 0.5983 2.9447 3.2079 4.7582 17.7662 84.1306 2.8843 13.8786 0.4099 9.3682 0.0364 22.0137 13.0318 11.8963 4.8927 60.7167 12.5109 1.2402 6.5611 22.7967 0.8671 3.6982 22.6545 0.0511 5.7142 9.4596 34.1079 15.5240 111.1671 0.0037 3.5615 3.9185 4.7669 353.6365 3.5186 8.3642 18.9948 0.2241 25.2286 35.0778 93.1489 48.6694 24.8261 0.0660 7.4199 3.9378 71.5854 0.1985 5.4214 1.2501 118.1694 63.4731 2.0353 21.2670 50.9048 17.2312 43.9148 7.1842 24.3099 2.6550 31.4527 10.6720 0.1060 4.5183 22.8736
temp: 298.150 k
press: 1.00000 atm
elementType: 8 8 8 8 6 6 6 6 6 6 6 6 6 6 6 6 6 6 6 6 6 6 6 6 6 6 6 6 1 1 1 1 1 1 1 1 1 1 1 1 1 1 1 1 1 1 1 1 1 1 1 1 1 1 1 1 1 1
symmnumber: 1
zpe: 1263078.6 jmol-1
zpe.correction: 0.481081 hartree
zpe.thermalcorrener: 0.510839 hartree
zpe.thermalcorrenthalpy: 0.511783 hartree
zpe.thermalcorrgfe: 0.416760 hartree
zpe.sumelectzpe: -1231.381543 hartree
zpe.sumelectthermal: -1231.351786 hartree
zpe.sumelectthermalent: -1231.350842 hartree
zpe.sumelectthermalfe: -1231.445865 hartree
dipole: -0.2414 0.0003 -0.0002
dipole: 0.2414
quadrupole: -139.2388 -158.8760 -169.8043
quadrupole: -0.0017 0.0006 -11.0742
quadrupole: 16.7342 -2.9029 -13.8313 -0.0017 0.0006 -11.0742
hfenergy: -1231.8626246 hartree
pointgroup: C01 [X(C24H30O4)]
dipole: -0.000109 0.0949883 0.0000782 debye
polarizability: 259.9632759|0.0019045|340.7925568|-5.5593345|0.0046534|201.2487596 unknown
InChI: InChI=1S/C24H30O4/c1-5-23(25)27-21-13-9-19(10-14-21)17(3)7-8-18(4)20-11-15-22(16-12-20)28-24(26)6-2/h9-18H,5-8H2,1-4H3
charge 0 multiplicity 1
58 atoms
O  3.069356 1.84887 0.509986
O  -3.06977 1.848533 -0.509488
O  1.426833 2.329602 -1.100504
O  -1.426806 2.329324 1.100537
C  -0.11382 -3.827773 0.765572
C  0.113861 -3.827749 -0.76574
C  1.171259 -3.522494 1.593656
C  -1.171242 -3.52254 -1.593813
C  1.677024 -2.098573 1.33449
C  -1.677142 -2.098692 -1.33452
C  0.9197 -3.763698 3.105425
C  -0.919648 -3.763588 -3.105601
C  0.83721 -0.976098 1.560666
C  -0.837429 -0.976122 -1.560596
C  2.985788 -1.863914 0.842378
C  -2.985911 -1.864202 -0.842341
C  1.265288 0.337503 1.282268
C  -1.265612 0.33741 -1.282035
C  3.439335 -0.5548 0.558734
C  -3.439561 -0.555159 -0.558533
C  2.564066 0.52638 0.769669
C  -2.564389 0.526118 -0.769374
C  2.402371 2.687718 -0.412383
C  -2.402792 2.687288 0.412972
C  3.076698 4.0499 -0.426843
C  -3.076703 4.049676 0.427083
C  2.388643 5.048087 -1.373875
C  -2.387993 5.048072 1.373418
H  -0.520287 -4.808942 1.084405
H  -0.885181 -3.075844 1.022367
H  0.520403 -4.808879 -1.0846
H  0.885164 -3.075754 -1.022514
H  1.963065 -4.227821 1.26461
H  -1.96298 -4.227973 -1.26483
H  0.120169 -3.099605 3.483713
H  0.607099 -4.808821 3.288924
H  1.829952 -3.564288 3.699014
H  -0.606942 -4.808664 -3.289189
H  -0.120179 -3.099386 -3.483827
H  -1.829915 -3.564217 -3.699178
H  -0.182381 -1.120293 1.935086
H  0.182168 -1.120191 -1.93505
H  3.657149 -2.713701 0.667962
H  -3.657192 -2.714067 -0.667998
H  0.582687 1.180773 1.423517
H  -0.583081 1.180753 -1.423185
H  4.446628 -0.370358 0.172352
H  -4.446856 -0.370848 -0.172096
H  3.096047 4.42603 0.6136
H  4.137369 3.897214 -0.705282
H  -4.137305 3.897403 0.706008
H  -3.096362 4.425368 -0.613513
H  1.341085 5.222157 -1.072566
H  2.920933 6.015385 -1.362246
H  2.375212 4.667967 -2.409538
H  -1.340507 5.221727 1.071621
H  -2.92002 6.015513 1.361592
H  -2.374256 4.668384 2.409236
