program: Gaussian 09
title: 000226966
version: EM64L-G09RevD.01
frameworkgroup: C1[X(C15H9ClO2)]
method: RPBEPBE
basis: SDD
operation: Freq
keyword: #p
keyword: freq=noraman
keyword: PBEPBE/SDD
title: #p freq=noraman PBEPBE/SDD
converged: YES YES NO NO
title: Mulliken charges:
elementType: Cl O O C C C C C C C C C C C C C C C H H H H H H H H H
charge: -0.051607 -0.247790 -0.201128 0.126160 0.377882 0.361247 -0.386632 0.163669 0.060953 -0.391779 -0.342017 -0.351811 -0.381765 -0.250940 -0.206770 -0.221624 -0.225821 -0.107519 0.256382 0.240818 0.268186 0.282386 0.238890 0.236728 0.239221 0.258288 0.256396
chargesum: 0.00000
title: Mulliken charges with hydrogens summed into heavy atoms:
elementType: Cl O O C C C C C C C C C C C C C C C
charge: -0.051607 -0.247790 -0.201128 0.126160 0.377882 0.361247 -0.130250 0.163669 0.060953 -0.150961 -0.073831 -0.069425 -0.142876 -0.014213 0.032451 0.036664 0.030575 -0.107519
polarizability: 3.64161790e+02 2.24904929e+01 1.69873484e+02 3.76953422e-01 -5.02567931e+00 7.33565351e+01
1716.lowfreq: -6.7075 -2.7568 -0.0022 -0.0020 -0.0014 6.0120 37.1058 52.1088 64.6483
frequency: 37.0716 52.1030 64.6432 97.7282 123.4637 193.5295 212.9638 239.0070 265.3006 303.0386 339.5984 355.8784 407.7311 423.0465 425.9459 438.6975 456.2275 515.7764 547.6532 551.8122 586.9789 606.0953 628.2336 698.5973 702.9659 721.1430 734.3082 750.6915 765.3228 808.2432 824.0732 832.7207 866.5551 869.8940 894.5233 924.3823 951.3239 957.2561 964.6149 988.9234 996.4654 1023.6044 1035.8881 1077.8041 1113.5580 1119.3875 1170.2386 1197.4582 1203.8767 1228.6556 1266.8974 1302.3695 1305.3368 1327.6779 1372.4426 1400.7856 1407.3820 1438.0989 1475.1817 1483.1446 1560.3084 1572.5463 1595.7826 1602.8947 1615.1572 1659.6316 3132.5405 3134.3891 3139.1395 3147.4415 3165.8501 3166.4286 3172.0106 3180.4572 3191.9925
redmass: 6.5556 4.2245 7.4224 7.9805 7.3642 7.1867 11.0043 6.4780 6.2243 5.7898 5.4835 4.5358 2.9481 7.9292 5.8054 7.8847 3.0966 3.4057 5.9680 4.2027 6.7063 7.3710 7.2782 6.2597 5.6928 5.9285 4.3893 4.3443 1.2539 3.8585 1.3378 1.7756 1.5585 4.2947 6.7474 1.4446 1.3608 1.4181 1.3766 1.3299 4.6481 2.0720 4.5103 2.5987 1.7429 1.3914 1.1184 1.1817 2.9279 1.6291 1.9419 1.3350 2.3640 2.4737 4.6912 3.4117 7.6042 2.5139 2.7355 2.6276 6.6839 7.2990 6.1131 6.7010 6.9530 11.9248 1.0888 1.0902 1.0893 1.0897 1.0905 1.0954 1.0958 1.0990 1.0956
irintensity: 0.0913 0.7976 0.7343 0.7840 1.0228 1.4034 0.0558 0.4126 0.2006 1.3972 0.9011 0.9526 1.2845 29.0722 5.1531 5.8919 2.9964 28.8899 4.6963 2.7749 4.3761 5.3704 1.3375 5.8908 5.3699 8.1593 1.7144 7.6581 78.8158 12.4481 3.3612 73.8876 18.8107 105.6712 7.0875 8.9660 1.4896 9.1835 1.8872 0.0633 30.3784 2.0204 48.1221 49.3135 19.4280 4.1934 3.3649 5.6072 6.9950 6.7600 7.9347 1.6331 50.6253 8.8208 2.7459 9.0015 6.0392 33.8209 18.4613 63.1109 12.7625 4.3279 30.6501 21.1007 121.4130 306.2517 1.2508 17.0829 4.1284 7.5631 2.7021 17.8078 3.5678 13.8983 1.9812
temp: 298.150 k
press: 1.00000 atm
elementType: 17 8 8 6 6 6 6 6 6 6 6 6 6 6 6 6 6 6 1 1 1 1 1 1 1 1 1
symmnumber: 1
zpe: 509076.2 jmol-1
zpe.correction: 0.193897 hartree
zpe.thermalcorrener: 0.207920 hartree
zpe.thermalcorrenthalpy: 0.208864 hartree
zpe.thermalcorrgfe: 0.151793 hartree
zpe.sumelectzpe: -1186.293473 hartree
zpe.sumelectthermal: -1186.279450 hartree
zpe.sumelectthermalent: -1186.278506 hartree
zpe.sumelectthermalfe: -1186.335577 hartree
dipole: -3.6148 -4.4276 -0.5833
dipole: 5.7455
quadrupole: -100.7950 -109.8236 -113.2458
quadrupole: 6.8776 0.1048 -4.0701
quadrupole: 7.1598 -1.8688 -5.2910 6.8776 0.1048 -4.0701
hfenergy: -1186.4873696 hartree
pointgroup: C01 [X(C15H9Cl1O2)]
dipole: 1.466402 -1.6019589 -0.6269789 debye
polarizability: 365.1137122|-14.2168004|142.7283571|-10.8871785|42.9160883|99.5497403 unknown
InChI: InChI=1S/C15H9ClO2/c16-12-7-5-10(6-8-12)13-9-11-3-1-2-4-14(11)18-15(13)17/h1-9H
charge 0 multiplicity 1
27 atoms
Cl -6.193759 -0.705139 -0.1375
O  1.886076 1.539007 0.705078
O  -0.180504 2.42646 1.116548
C  -0.123125 0.160039 0.178439
C  2.176786 -0.721194 -0.18903
C  -1.600344 -0.00279 0.098518
C  0.740886 -0.853507 -0.216346
C  2.726087 0.506796 0.280047
C  0.439607 1.431326 0.694141
C  3.076107 -1.748596 -0.598412
C  4.117031 0.726645 0.34317
C  -2.48391 0.629428 1.019101
C  -2.166835 -0.836533 -0.908515
C  4.464162 -1.543284 -0.541738
C  4.982805 -0.304444 -0.07159
C  -3.876687 0.41567 0.954244
C  -3.556301 -1.056863 -0.986996
C  -4.39483 -0.429247 -0.045269
H  0.322739 -1.810671 -0.548691
H  2.668813 -2.700272 -0.959293
H  4.491453 1.685938 0.711206
H  -2.082544 1.297489 1.783786
H  -1.523517 -1.294253 -1.668134
H  5.150072 -2.335083 -0.858656
H  6.065798 -0.148285 -0.029478
H  -4.545469 0.901854 1.670064
H  -3.9786 -1.68999 -1.772292
