program: Gaussian 09
title: 000226958
version: EM64L-G09RevD.01
frameworkgroup: C1[X(C16H25NO)]
method: RPBEPBE
basis: SDD
operation: Freq
keyword: #p
keyword: freq=noraman
keyword: PBEPBE/SDD
title: #p freq=noraman PBEPBE/SDD
converged: YES YES NO NO
title: Mulliken charges:
elementType: O N C C C C C C C C C C C C C C C C H H H H H H H H H H H H H H H H H H H H H H H H H
charge: -0.279961 -0.127396 -0.396657 -0.369926 -0.339960 -0.351785 -0.337609 -0.342224 0.095476 0.274596 -0.693576 -0.697658 -0.484020 -0.393516 0.441892 -0.214729 -0.405381 -0.815556 0.213969 0.246353 0.192867 0.247869 0.195765 0.196951 0.180655 0.242807 0.199132 0.194600 0.204298 0.187321 0.212167 0.219266 0.211904 0.207821 0.215889 0.217884 0.237654 0.264086 0.227581 0.233086 0.226499 0.228933 0.232632
chargesum: 0.00000
title: Mulliken charges with hydrogens summed into heavy atoms:
elementType: O N C C C C C C C C C C C C C C C C
charge: -0.279961 -0.127396 0.063666 0.070810 0.052756 0.071678 0.056123 0.049394 0.095476 0.274596 -0.050239 -0.056064 -0.246366 -0.129430 0.441892 0.012852 -0.172296 -0.127492
polarizability: 2.30275989e+02 6.51369733e-01 1.95150867e+02 7.91291934e+00 -1.19598167e+01 1.28515149e+02
1716.lowfreq: -17.6064 -6.5967 -5.3140 -0.0005 -0.0004 0.0003 9.4764 22.5713 32.1481
frequency: -17.1769 22.3726 32.1079 36.4459 43.3602 58.6845 62.5951 81.4920 100.6778 122.8124 144.1306 151.6506 181.0460 208.4777 227.6978 233.7121 234.1844 257.0063 288.8788 309.7101 337.7293 374.8245 389.6089 403.9003 432.7921 471.5690 491.4761 517.7466 584.8511 650.2948 694.1346 703.3064 724.7152 726.9178 734.8086 784.6517 790.1946 808.6903 844.2244 897.4394 901.1213 902.9062 915.3542 921.6960 928.7068 954.6379 986.7171 989.4199 997.3604 1012.0391 1021.6069 1048.3854 1069.3246 1072.6598 1084.4529 1097.2248 1108.3490 1111.1148 1115.5296 1173.1970 1181.7007 1197.0237 1211.9229 1237.5415 1252.6094 1264.6173 1265.3725 1284.6533 1285.5365 1293.4344 1305.5419 1307.9983 1340.1454 1344.8081 1359.6842 1364.6820 1376.7277 1389.6816 1393.0920 1395.6067 1403.9173 1419.8777 1446.9136 1465.1753 1467.1667 1467.7362 1470.6881 1472.7807 1474.8137 1477.3047 1478.2695 1479.6888 1482.8600 1486.7119 1489.2363 1546.1069 1595.8684 1611.5986 2960.8908 2962.3812 2966.6104 2971.4888 2973.6202 2974.0923 2975.2397 2981.4091 3001.2366 3007.3525 3010.9653 3037.2443 3046.1639 3055.0998 3068.8694 3069.9044 3073.0279 3074.3284 3075.0468 3079.8338 3085.1791 3120.9682 3129.9635 3143.3159 3165.3069
redmass: 1.0211 3.6334 3.6321 3.2718 4.2641 1.6166 1.6079 4.4881 3.3517 2.4559 3.4410 2.6818 3.8776 3.0517 1.1881 2.5075 1.1893 2.9836 3.1478 4.0836 3.1238 2.9199 3.5973 2.8382 2.9156 3.4563 4.3417 5.0086 4.1300 5.4241 3.6905 4.2229 1.7697 1.2307 1.1443 1.2126 1.2325 1.7112 4.4776 1.8154 1.6939 1.3283 1.6485 1.2518 1.4150 1.8231 1.5189 3.3913 1.6866 3.8496 3.6115 1.5678 2.4794 2.5216 1.9344 1.7655 1.5602 2.2668 2.3119 1.9115 1.1099 2.3358 1.7076 1.7220 1.8487 1.3040 1.3057 1.1047 1.2827 1.1790 1.2811 1.3281 1.4033 1.4699 1.3844 1.3782 8.1771 1.2141 1.2152 1.2232 2.3796 2.6714 1.1537 1.1531 1.0815 1.3077 1.1766 1.0615 1.0661 1.0470 1.0459 1.0695 1.5723 1.0784 1.0877 6.2955 5.8680 6.2265 1.0675 1.0591 1.0590 1.0618 1.0391 1.0387 1.0370 1.0600 1.0639 1.0988 1.0953 1.1003 1.0969 1.0953 1.1003 1.0979 1.0998 1.0985 1.0993 1.1034 1.0995 1.0875 1.0905 1.0923 1.0978
irintensity: 0.5328 0.2855 0.2210 0.2021 1.3382 0.0596 0.0421 1.9394 1.4973 0.5568 0.2088 1.6981 0.4378 2.8337 0.0942 0.4489 0.0806 0.5096 0.8815 2.0809 3.7148 11.2020 0.8650 1.4182 4.7139 11.6081 8.4994 0.1575 2.0191 6.2109 4.6417 4.8696 47.9347 10.8839 9.3948 1.1427 3.1140 31.3205 5.1335 9.1437 12.1531 8.9019 1.7163 5.4482 5.4758 7.5785 0.2205 0.2978 1.6409 4.9716 0.5750 13.1830 0.3057 1.3032 60.0964 10.7237 3.8153 9.4009 16.9249 17.2387 2.1666 12.6879 43.7996 2.3172 7.3779 1.9231 3.5811 7.9481 52.9233 29.3645 0.6553 40.4952 1.0123 0.8999 9.7180 10.1775 0.4748 10.3302 8.5702 11.9534 84.3507 51.1969 29.6040 5.3868 4.2303 10.0069 9.1765 15.3208 5.1846 7.8400 10.2948 11.5225 1.3456 9.3426 27.1381 227.7348 7.1628 4.2606 16.5375 24.9781 23.5585 26.8720 52.2686 23.5419 32.3750 60.3431 45.0466 0.6534 15.5460 36.4516 8.5414 22.2102 39.3197 13.5215 76.5406 57.4004 57.4881 60.8626 17.2517 9.1202 13.4023 19.7211 13.2139
temp: 298.150 k
press: 1.00000 atm
elementType: 8 7 6 6 6 6 6 6 6 6 6 6 6 6 6 6 6 6 1 1 1 1 1 1 1 1 1 1 1 1 1 1 1 1 1 1 1 1 1 1 1 1 1
symmnumber: 1
zpe: 983159.0 jmol-1
zpe.correction: 0.374466 hartree
zpe.thermalcorrener: 0.394422 hartree
zpe.thermalcorrenthalpy: 0.395366 hartree
zpe.thermalcorrgfe: 0.323477 hartree
zpe.sumelectzpe: -753.295522 hartree
zpe.sumelectthermal: -753.275566 hartree
zpe.sumelectthermalent: -753.274622 hartree
zpe.sumelectthermalfe: -753.346511 hartree
dipole: 0.9432 3.9276 1.7783
dipole: 4.4134
quadrupole: -98.8895 -113.6968 -113.9888
quadrupole: -3.1026 0.5599 -6.8561
quadrupole: 9.9689 -4.8384 -5.1304 -3.1026 0.5599 -6.8561
hfenergy: -753.6699879 hartree
pointgroup: C01 [X(C16H25N1O1)]
dipole: -0.5123979 1.5603387 -0.563703 debye
polarizability: 230.1980784|2.0323561|192.6512498|6.3293681|18.1639068|131.0926768 unknown
InChI: InChI=1S/C16H25NO/c1-4-6-11-17(12-7-5-2)16(18)15-10-8-9-14(3)13-15/h8-10,13H,4-7,11-12H2,1-3H3
charge 0 multiplicity 1
43 atoms
O  1.053715 -2.21249 0.811674
N  0.997384 0.058673 0.317421
C  0.475532 1.209952 -0.454651
C  2.404765 0.155158 0.783015
C  0.114938 2.446674 0.402063
C  3.430688 -0.287067 -0.287354
C  -0.351624 3.634685 -0.470558
C  4.886642 -0.141443 0.208882
C  0.399379 -1.199869 0.388987
C  -1.043398 -1.366758 -0.028653
C  -0.718979 4.878714 0.366712
C  5.920396 -0.593612 -0.845032
C  -2.080518 -0.502558 0.402323
C  -1.37374 -2.520694 -0.784701
C  -3.43738 -0.754429 0.075383
C  -2.716255 -2.775404 -1.130382
C  -3.741351 -1.898711 -0.704351
C  -4.533603 0.188926 0.542734
H  1.246862 1.505946 -1.196928
H  -0.408118 0.883105 -1.027595
H  2.595651 1.202079 1.086394
H  2.511516 -0.490324 1.671983
H  0.991443 2.759305 1.004005
H  -0.680663 2.180758 1.125254
H  3.295946 0.312593 -1.211304
H  3.228672 -1.34271 -0.547124
H  -1.226438 3.323837 -1.077581
H  0.449706 3.896901 -1.191366
H  5.016486 -0.73999 1.133194
H  5.08079 0.914889 0.488995
H  0.14872 5.231043 0.955487
H  -1.052817 5.713877 -0.275669
H  -1.535518 4.651293 1.077515
H  5.830315 0.003638 -1.772165
H  6.9548 -0.483403 -0.47077
H  5.769094 -1.655548 -1.114466
H  -1.83825 0.362153 1.031536
H  -0.574364 -3.21146 -1.071056
H  -2.968682 -3.663929 -1.719747
H  -4.78518 -2.111575 -0.965749
H  -5.518082 -0.310135 0.554186
H  -4.333202 0.569238 1.560429
H  -4.617378 1.068274 -0.125372
