program: Gaussian 09
title: 000226956
version: EM64L-G09RevD.01
frameworkgroup: C1[X(C16H16O2)]
method: RPBEPBE
basis: SDD
operation: Freq
keyword: #pfreq=noraman
keyword: PBEPBE/SDD
title: #p freq=noraman PBEPBE/SDD
converged: YES YES NO NO
title: Mulliken charges:
elementType: O O C C C C C C C C C C C C C C C C H H H H H H H H H H H H H H H H
charge: -0.287533 -0.258767 -0.579707 0.499378 -0.244894 0.225612 -0.408869 -0.382750 0.458403 -0.485501 0.190845 -0.361690 -0.384539 -0.224356 -0.228736 -0.211005 -0.242339 -0.809953 0.224830 0.207438 0.235765 0.237339 0.228959 0.227765 0.271296 0.270634 0.234243 0.224689 0.223820 0.231105 0.227719 0.239220 0.224345 0.227232
chargesum: 0.00000
title: Mulliken charges with hydrogens summed into heavy atoms:
elementType: O O C C C C C C C C C C C C C C C C
charge: -0.287533 -0.258767 -0.147438 0.499378 0.228211 0.225612 -0.179910 -0.154984 0.458403 -0.214206 0.190845 -0.091056 -0.150296 0.000333 -0.004916 0.020100 -0.014619 -0.119156
polarizability: 2.02359169e+02 -9.84283781e+00 2.03123519e+02 -7.97081026e+00 5.37286801e+00 1.13015149e+02
1716.lowfreq: -5.0895 -0.0008 -0.0007 -0.0005 1.7505 5.1226 13.5252 18.6597 26.4043
frequency: 13.0908 18.5984 26.3996 46.6044 54.6240 77.7033 96.5409 146.8945 188.7524 210.0164 219.1758 234.0607 333.5201 337.5502 345.0055 392.0865 403.2604 426.5906 475.7444 490.3298 494.1361 524.6934 565.0335 617.9596 661.0752 685.0157 704.0573 723.5556 749.2372 760.8501 770.7815 816.6788 818.7788 851.9511 897.7208 912.3787 917.4091 950.0994 961.2943 974.4825 985.0839 989.9071 991.8286 993.1599 998.0457 999.8424 1027.4799 1048.0370 1051.3395 1059.1009 1091.0288 1103.4878 1171.6534 1179.0259 1182.5446 1185.9228 1191.9510 1216.5271 1231.1732 1267.3547 1303.2910 1324.6383 1336.7129 1358.8997 1383.9363 1386.4816 1398.3368 1422.6902 1440.6487 1458.6544 1467.5160 1470.8255 1473.8780 1482.4853 1485.0227 1593.4399 1594.6089 1607.7591 1615.6143 1623.6775 2977.3591 2993.3561 3005.5221 3053.1103 3059.2810 3074.2849 3087.0626 3111.8609 3118.7298 3121.3723 3132.4035 3143.7078 3145.4414 3157.0914 3161.9323 3167.0099
redmass: 4.1353 4.1906 4.5781 1.0132 6.2184 4.4089 6.5479 3.2923 4.5253 3.1823 3.5985 4.5159 3.3925 4.9699 2.2593 3.3567 2.8138 3.0232 4.6316 3.9936 3.9551 5.1354 2.8919 6.2986 6.7647 3.4953 1.7586 2.4385 3.7126 1.9066 4.3722 1.7387 3.0110 1.2505 3.3787 1.4961 1.3168 1.4292 2.5187 1.4059 2.2822 5.7271 3.6136 1.3655 1.5975 1.3570 2.1093 2.1970 1.6333 3.6249 1.6162 1.5492 1.0579 1.0973 1.1811 1.1941 1.7374 2.1804 1.2120 4.0447 1.3014 1.3276 1.4648 1.4362 7.2029 7.9362 1.2247 2.7160 2.1363 1.1162 1.1011 1.5429 1.0585 1.6009 2.2934 6.6781 6.0716 7.2586 6.2029 8.2082 1.0384 1.0603 1.0587 1.1006 1.0953 1.1074 1.0999 1.0876 1.0861 1.0882 1.0911 1.0960 1.0916 1.0919 1.1015 1.0981
irintensity: 0.5703 0.0256 0.0040 0.7175 1.8022 0.9986 0.6132 2.1160 0.7597 0.3879 5.3043 5.5477 6.1427 0.0391 0.8134 3.5112 0.0389 1.1729 2.9925 13.4540 5.4535 0.3129 17.8569 0.1928 1.9692 1.0301 57.2831 55.4690 18.6112 24.5385 8.9939 23.1371 3.4996 0.2446 17.9359 2.2110 1.0392 4.4462 6.7777 0.1044 3.6756 1.3163 0.8589 1.0575 11.7490 0.5266 5.2419 2.8808 25.9555 313.2088 7.6560 1.4506 0.1618 5.5398 8.8383 33.8611 176.2708 0.4040 5.3311 206.4674 3.3630 1.4156 2.0422 6.8537 0.1010 2.7547 12.7605 0.3352 7.5261 14.3246 9.1352 20.6939 14.5401 8.5852 16.0517 94.8590 0.4012 73.5848 5.8377 76.6812 27.7366 19.2225 30.4675 13.6873 20.9501 34.9188 19.2996 9.4147 5.1887 10.7688 13.7852 48.1331 15.8105 3.6785 19.3514 13.9149
temp: 298.150 k
press: 1.00000 atm
elementType: 8 8 6 6 6 6 6 6 6 6 6 6 6 6 6 6 6 6 1 1 1 1 1 1 1 1 1 1 1 1 1 1 1 1
symmnumber: 1
zpe: 721329.5 jmol-1
zpe.correction: 0.274740 hartree
zpe.thermalcorrener: 0.291434 hartree
zpe.thermalcorrenthalpy: 0.292378 hartree
zpe.thermalcorrgfe: 0.226192 hartree
zpe.sumelectzpe: -768.477620 hartree
zpe.sumelectthermal: -768.460926 hartree
zpe.sumelectthermalent: -768.459982 hartree
zpe.sumelectthermalfe: -768.526168 hartree
dipole: 0.4368 2.2910 0.7733
dipole: 2.4571
quadrupole: -93.8302 -101.8467 -106.1452
quadrupole: -10.3097 -2.2723 -2.3924
quadrupole: 6.7772 -1.2393 -5.5378 -10.3097 -2.2723 -2.3924
hfenergy: -768.75236 hartree
pointgroup: C01 [X(C16H16O2)]
dipole: 0.205242 -0.8952785 -0.3014471 debye
polarizability: 201.4376169|9.6876219|203.7222541|9.4101524|5.8830394|113.3379656 unknown
InChI: InChI=1S/C16H16O2/c1-13-6-5-9-15(12-13)16(17)18-11-10-14-7-3-2-4-8-14/h2-9,12H,10-11H2,1H3
charge 0 multiplicity 1
34 atoms
O  0.061095 1.250218 -0.445603
O  -1.318448 2.885185 0.477454
C  2.360313 1.588546 -1.17635
C  2.94518 0.387029 -0.446136
C  1.172832 2.239339 -0.44997
C  -2.198019 0.638406 0.086492
C  3.893876 0.566065 0.593365
C  2.540299 -0.931734 -0.773396
C  -2.916438 -1.692345 -0.265357
C  -1.910159 -0.697269 -0.292807
C  -1.155823 1.705173 0.07516
C  -3.507631 0.994401 0.498968
C  -4.224387 -1.317868 0.141188
C  4.421127 -0.542821 1.292989
C  3.066623 -2.044314 -0.078936
C  -4.517634 0.012406 0.521967
C  4.008668 -1.853534 0.958433
C  -2.59852 -3.130682 -0.636491
H  2.031517 1.302641 -2.192356
H  3.132571 2.374057 -1.293552
H  0.82911 3.154518 -0.96572
H  1.416099 2.497963 0.596869
H  4.226748 1.579393 0.853193
H  1.80849 -1.082874 -1.576201
H  -0.890576 -0.950391 -0.600556
H  -3.70637 2.03078 0.790444
H  -5.017694 -2.075466 0.160293
H  5.155017 -0.38613 2.091782
H  2.744845 -3.057378 -0.346566
H  -5.533452 0.279726 0.832716
H  4.419019 -2.715143 1.49698
H  -2.255164 -3.700813 0.248541
H  -3.485217 -3.651198 -1.038988
H  -1.795899 -3.185786 -1.392649
