program: Gaussian 09
title: 000226939
version: EM64L-G09RevD.01
frameworkgroup: C1[X(C14H18O2)]
method: RPBEPBE
basis: SDD
operation: Freq
keyword: #pfreq=noraman
keyword: PBEPBE/SDD
title: #p freq=noraman PBEPBE/SDD
converged: YES YES NO NO
title: Mulliken charges:
elementType: O O C C C C C C C C C C C C C C H H H H H H H H H H H H H H H H H H
charge: -0.312344 -0.262639 0.005499 -0.448605 -0.434639 -0.384041 -0.391940 -0.383992 0.188614 0.224718 -0.487345 -0.361193 0.458042 -0.210388 -0.392820 -0.810549 0.246337 0.245289 0.200186 0.193862 0.216235 0.210762 0.198766 0.198853 0.208029 0.188523 0.201510 0.268305 0.271319 0.230702 0.234057 0.224004 0.237915 0.228968
chargesum: 0.00000
title: Mulliken charges with hydrogens summed into heavy atoms:
elementType: O O C C C C C C C C C C C C C C
charge: -0.312344 -0.262639 0.251835 -0.003130 -0.024542 0.025488 0.014942 0.006041 0.188614 0.224718 -0.219040 -0.089874 0.458042 0.020314 -0.158763 -0.119662
polarizability: 2.00008355e+02 3.83767437e+00 1.63183060e+02 7.89569637e+00 -3.21934223e+00 1.01613881e+02
1716.lowfreq: -42.4831 -8.4271 -5.9553 0.0004 0.0005 0.0008 8.7038 27.2915 42.3324
frequency: -42.2696 26.8317 42.1737 61.7207 72.0014 130.4006 151.8869 203.8726 215.2659 229.9195 248.3806 326.0565 337.1656 362.5765 398.0538 424.8847 456.7758 468.9624 477.2807 498.0978 522.0340 640.1643 658.9072 684.9847 723.9870 756.5554 774.7722 795.2209 812.9771 816.4856 864.5787 871.9253 880.9203 905.2561 916.6296 925.0687 949.4287 989.7038 997.1288 999.5135 1011.7434 1048.2396 1050.4579 1051.9795 1056.7965 1087.5488 1102.2014 1118.0127 1121.9133 1165.4242 1178.7317 1190.6909 1234.4699 1259.1146 1263.2384 1272.5842 1301.9870 1316.2793 1323.3738 1332.8765 1339.1693 1350.8871 1359.9733 1361.9930 1385.4888 1398.5589 1421.8974 1451.6585 1459.5165 1463.2876 1469.7090 1470.2386 1473.2171 1476.6817 1481.7058 1591.4579 1604.9846 1620.7927 2962.0865 2977.0795 2977.1841 2980.4839 2983.7717 2985.3248 3029.0163 3033.1749 3038.9502 3045.7544 3051.5092 3057.3718 3058.7515 3086.6521 3122.4919 3145.3617 3155.7943 3166.9839
redmass: 1.0154 3.4694 3.9722 3.9180 5.9667 3.7058 3.8882 2.6246 3.0456 5.1174 2.7885 2.2095 4.2152 2.4844 2.4938 3.0092 3.2907 3.1689 2.3498 3.9386 4.8932 2.8385 6.7781 3.4458 2.4640 6.0407 1.5062 2.9422 2.9927 1.6605 2.2061 2.0785 2.5022 3.3002 1.3186 1.4157 1.4262 5.5500 1.5327 1.3592 2.7843 1.4754 1.8191 1.6871 2.4529 1.6253 1.5361 1.0357 2.0384 1.7236 1.1005 1.9915 1.2978 1.2820 2.1898 1.5366 1.3040 1.7156 1.5243 1.3946 1.4490 1.4472 1.4149 1.4845 7.6233 1.2300 2.7702 1.0850 1.0889 1.0872 1.2121 1.3040 1.0982 1.0934 1.5519 7.1385 7.2378 7.6640 1.0632 1.0387 1.0637 1.0633 1.0627 1.0619 1.0936 1.0896 1.0994 1.0992 1.1005 1.1004 1.0954 1.0998 1.0879 1.0920 1.0918 1.0980
irintensity: 0.6462 0.0430 0.9693 1.1751 0.8930 0.3315 0.2824 0.1713 3.0028 6.2809 2.1264 0.2008 7.4826 1.0037 1.6801 1.4750 4.5367 0.4576 1.7337 7.0951 0.4587 0.4058 3.2131 1.1713 53.0542 1.9331 0.2616 6.8973 4.6824 22.8412 11.4460 15.9360 6.2235 54.8431 1.4894 9.5220 4.6527 0.8747 10.2045 0.7502 30.1431 20.4036 84.4959 44.3630 146.5017 2.2279 0.4356 0.8184 15.6619 12.8549 4.9499 223.8427 8.9228 7.3347 152.5517 46.4375 3.1117 2.4418 10.6786 0.8378 1.0803 2.1020 2.2562 2.4829 1.7564 14.1267 0.2810 10.6744 10.3879 9.2778 22.3058 17.2740 13.4725 7.7212 7.7384 120.1164 57.1022 40.8207 41.3635 30.9190 5.6506 47.1690 16.3426 35.6725 78.8244 6.1826 62.9834 24.4901 36.6284 89.2935 21.1037 17.5939 10.5276 17.5379 4.1362 13.2998
temp: 298.150 k
press: 1.00000 atm
elementType: 8 8 6 6 6 6 6 6 6 6 6 6 6 6 6 6 1 1 1 1 1 1 1 1 1 1 1 1 1 1 1 1 1 1
symmnumber: 1
zpe: 754515.7 jmol-1
zpe.correction: 0.287380 hartree
zpe.thermalcorrener: 0.301756 hartree
zpe.thermalcorrenthalpy: 0.302700 hartree
zpe.thermalcorrgfe: 0.244801 hartree
zpe.sumelectzpe: -693.561210 hartree
zpe.sumelectthermal: -693.546834 hartree
zpe.sumelectthermalent: -693.545890 hartree
zpe.sumelectthermalfe: -693.603789 hartree
dipole: 0.0185 2.6403 0.0050
dipole: 2.6404
quadrupole: -78.9806 -98.2667 -97.1754
quadrupole: 2.2230 1.9698 -0.9082
quadrupole: 12.4937 -6.7924 -5.7012 2.2230 1.9698 -0.9082
hfenergy: -693.8485901 hartree
pointgroup: C01 [X(C14H18O2)]
dipole: -0.0070806 -1.0334505 0.1052385 debye
polarizability: 200.5177537|-4.2259265|161.9267827|-0.7294888|-9.7504601|102.3607599 unknown
InChI: InChI=1S/C14H18O2/c1-11-6-5-7-12(10-11)14(15)16-13-8-3-2-4-9-13/h5-7,10,13H,2-4,8-9H2,1H3
charge 0 multiplicity 1
34 atoms
O  -0.887661 0.29255 0.290947
O  -0.123144 2.460893 -0.116824
C  -2.308579 0.800515 0.308891
C  -2.840358 0.873649 -1.136927
C  -3.093796 -0.190357 1.182547
C  -2.965171 -0.52527 -1.784599
C  -3.223108 -1.58442 0.522098
C  -3.81202 -1.477179 -0.905325
C  0.11406 1.237755 0.059593
C  1.476754 0.624641 0.057155
C  1.675845 -0.764684 0.25667
C  2.589556 1.47754 -0.159072
C  2.977557 -1.321814 0.247698
C  3.888569 0.932448 -0.172614
C  4.079954 -0.454972 0.027256
C  3.188701 -2.806757 0.488935
H  -2.281271 1.810988 0.757016
H  -2.189703 1.537853 -1.73385
H  -3.839754 1.354383 -1.097072
H  -4.104169 0.238313 1.343885
H  -2.610219 -0.267659 2.173979
H  -1.953236 -0.95592 -1.917955
H  -3.412329 -0.430163 -2.792583
H  -3.855089 -2.238528 1.152937
H  -2.220743 -2.052689 0.469726
H  -4.851796 -1.091993 -0.844853
H  -3.86799 -2.4798 -1.371352
H  0.802704 -1.404377 0.419691
H  2.412608 2.546784 -0.313756
H  4.753149 1.583306 -0.342568
H  5.095015 -0.870698 0.010725
H  4.145851 -3.154529 0.062734
H  3.207361 -3.034346 1.57242
H  2.376947 -3.408363 0.043145
