program: Gaussian 09
title: 000226938
version: EM64L-G09RevD.01
frameworkgroup: C1[X(C14H18O2)]
method: RPBEPBE
basis: SDD
operation: Freq
keyword: #pfreq=noraman
keyword: PBEPBE/SDD
title: #p freq=noraman PBEPBE/SDD
converged: YES YES NO NO
title: Mulliken charges:
elementType: O O C C C C C C C C C C C C C C H H H H H H H H H H H H H H H H H H
charge: -0.319124 -0.262915 0.005940 -0.445563 -0.433108 -0.384188 -0.392544 -0.384165 0.194158 0.066868 0.357103 -0.327573 -0.406963 -0.782034 -0.238575 -0.217871 0.245935 0.240504 0.199486 0.193221 0.216306 0.210488 0.198353 0.198987 0.207828 0.188665 0.201630 0.270103 0.233870 0.246030 0.208212 0.249388 0.231600 0.229952
chargesum: 0.00000
title: Mulliken charges with hydrogens summed into heavy atoms:
elementType: O O C C C C C C C C C C C C C C
charge: -0.319124 -0.262915 0.251875 -0.005572 -0.023582 0.024653 0.014271 0.006129 0.194158 0.066868 0.357103 -0.057471 -0.173094 -0.078405 -0.006975 0.012080
polarizability: 1.99813438e+02 5.51577771e+00 1.64053042e+02 6.58415802e+00 -2.95322176e-01 1.00740906e+02
1716.lowfreq: -7.2901 -1.1858 -0.0007 0.0002 0.0004 5.7201 21.7889 39.7650 56.0774
frequency: 19.7787 39.5400 55.8924 70.9649 129.8962 145.0593 181.8226 198.2824 216.1031 236.6342 279.8919 313.9668 361.5570 381.8028 389.2576 430.7580 459.6686 469.5038 476.8020 494.5573 550.5432 636.9647 654.7964 681.8134 736.8526 753.6014 770.8122 789.7320 797.9768 803.4031 833.9079 865.1218 873.0773 882.9203 895.7404 922.8560 969.7010 995.4437 1000.1561 1010.9245 1028.2325 1044.4781 1048.6434 1050.3426 1053.5322 1085.9982 1116.9591 1120.1570 1136.0953 1164.5985 1176.7882 1208.3789 1226.2192 1234.9601 1258.4352 1269.8220 1282.6452 1316.9043 1322.2671 1332.2773 1338.2296 1350.6198 1359.3760 1362.5427 1374.2319 1404.8819 1424.5638 1447.1319 1454.5500 1458.4470 1460.4903 1467.3663 1468.5767 1475.5406 1477.1764 1573.5580 1600.2430 1616.8524 2961.2356 2975.7323 2980.2535 2984.0664 2984.2631 2991.6418 3028.0823 3034.8954 3038.4088 3045.8386 3050.3133 3055.9724 3078.3585 3090.2449 3124.5508 3139.8656 3157.3833 3180.9743
redmass: 3.5460 3.9842 6.2808 3.6255 3.8473 3.7094 1.1244 2.1908 3.0137 3.1337 4.3591 2.3567 2.7376 3.2952 2.7724 3.2549 2.5830 3.4583 2.2771 3.3696 5.8372 3.0221 5.7441 4.6507 1.8011 5.1055 1.5286 2.0424 2.7117 3.7564 3.8940 2.2321 1.8630 1.3056 2.9330 1.3966 1.3842 1.5754 1.3402 2.8232 6.8042 1.5803 1.4865 2.1781 1.5725 1.6276 1.0327 2.0773 1.6665 1.7292 1.0637 3.0061 2.9351 1.3015 1.2420 1.2370 1.4623 1.7482 1.4550 1.3980 1.4492 1.4543 1.4755 1.4291 5.4615 1.2890 1.8826 1.0872 1.0484 1.0882 1.0863 1.2443 1.0841 1.1012 2.3579 7.1701 7.3546 7.4504 1.0634 1.0644 1.0623 1.0642 1.0607 1.0365 1.0949 1.0887 1.0993 1.0985 1.0999 1.1014 1.0959 1.1011 1.0860 1.0909 1.0969 1.0960
irintensity: 0.0524 1.1735 1.0100 0.4490 0.5179 0.8983 1.8496 1.7095 1.2263 0.2714 9.1841 2.3441 1.5558 0.5583 1.7782 1.3117 6.3749 1.1154 0.3773 6.9828 0.1131 0.2111 8.4846 13.5997 50.4247 1.4939 0.5520 22.6537 6.1385 0.3983 5.0323 11.0299 15.9565 0.1541 33.8135 9.8175 0.5576 0.1268 0.0134 37.1359 331.0381 10.6819 4.7583 7.7889 2.6742 1.6449 0.7454 29.8556 35.2792 9.0054 4.5797 38.6231 331.9878 0.6062 3.1595 0.4064 1.9764 2.5981 4.4491 0.3723 0.8102 1.0663 0.9183 3.3919 9.0413 18.8414 1.5589 9.9481 12.7007 9.7521 9.3401 36.7405 20.6321 4.6503 16.2447 43.8906 64.8623 103.2947 41.4989 8.5981 46.6261 11.4842 39.9260 21.7440 74.5446 6.9821 65.4625 29.1690 14.5522 111.5409 10.3327 29.4629 3.4883 20.3470 28.8745 9.3285
temp: 298.150 k
press: 1.00000 atm
elementType: 8 8 6 6 6 6 6 6 6 6 6 6 6 6 6 6 1 1 1 1 1 1 1 1 1 1 1 1 1 1 1 1 1 1
symmnumber: 1
zpe: 755275.9 jmol-1
zpe.correction: 0.287669 hartree
zpe.thermalcorrener: 0.302615 hartree
zpe.thermalcorrenthalpy: 0.303560 hartree
zpe.thermalcorrgfe: 0.244287 hartree
zpe.sumelectzpe: -693.557857 hartree
zpe.sumelectthermal: -693.542911 hartree
zpe.sumelectthermalent: -693.541966 hartree
zpe.sumelectthermalfe: -693.601239 hartree
dipole: -0.4592 1.5542 0.0320
dipole: 1.6209
quadrupole: -80.9845 -95.5880 -97.4171
quadrupole: 2.9071 1.7014 0.2213
quadrupole: 10.3454 -4.2581 -6.0873 2.9071 1.7014 0.2213
hfenergy: -693.845526 hartree
pointgroup: C01 [X(C14H18O2)]
dipole: -0.1371111 0.6220371 0.0308462 debye
polarizability: 200.7189503|2.8726169|163.4658879|3.4812363|0.5663835|100.4225476 unknown
InChI: InChI=1S/C14H18O2/c1-11-7-5-6-10-13(11)14(15)16-12-8-3-2-4-9-12/h5-7,10,12H,2-4,8-9H2,1H3
charge 0 multiplicity 1
34 atoms
O  -0.844756 -0.095199 -0.232109
O  0.168937 -2.180936 -0.019497
C  -2.188314 -0.773301 -0.320958
C  -2.739775 -0.990376 1.103251
C  -3.073732 0.158157 -1.164059
C  -3.053115 0.344655 1.81857
C  -3.39297 1.487076 -0.438016
C  -3.992567 1.232135 0.966399
C  0.271543 -0.926452 -0.067008
C  1.539375 -0.139808 0.033483
C  2.811384 -0.796756 0.121495
C  1.469845 1.281898 0.050011
C  3.968251 0.019837 0.223148
C  2.984181 -2.30416 0.10773
C  2.633175 2.066283 0.154401
C  3.892184 1.428806 0.241782
H  -2.025737 -1.746315 -0.819797
H  -2.024359 -1.599652 1.684905
H  -3.669488 -1.58916 1.009724
H  -4.018415 -0.383972 -1.374687
H  -2.583469 0.349454 -2.136508
H  -2.1058 0.888633 2.002455
H  -3.506614 0.139988 2.807266
H  -4.090109 2.08929 -1.051693
H  -2.460384 2.075667 -0.334711
H  -4.97688 0.729155 0.860553
H  -4.179207 2.194383 1.481172
H  0.486597 1.753286 -0.022012
H  4.947741 -0.467945 0.289443
H  2.548845 -2.755998 -0.80061
H  4.055119 -2.566695 0.159922
H  2.455864 -2.780953 0.951514
H  2.561309 3.159028 0.167335
H  4.808842 2.023944 0.323406
