program: Gaussian 09
title: 000226934
version: EM64L-G09RevD.01
frameworkgroup: C1[X(C13H18O4)]
method: RPBEPBE
basis: SDD
operation: Freq
keyword: #pfreq=noraman
keyword: PBEPBE/SDD
title: #p freq=noraman PBEPBE/SDD
converged: YES YES NO NO
title: Mulliken charges:
elementType: O O O O C C C C C C C C C C C C C H H H H H H H H H H H H H H H H H H
charge: -0.295197 -0.274646 -0.251425 -0.199542 0.056655 -0.417469 -0.259540 -0.714039 -0.505893 0.222974 -0.395813 0.360198 -0.337546 -0.371295 -0.227351 -0.196098 -0.254598 0.174519 0.225918 0.206578 0.219034 0.264734 0.216026 0.229248 0.219391 0.199223 0.235902 0.206309 0.239080 0.241902 0.245497 0.257031 0.223648 0.228411 0.228175
chargesum: 0.00000
title: Mulliken charges with hydrogens summed into heavy atoms:
elementType: O O O O C C C C C C C C C C C C C
charge: -0.295197 -0.274646 -0.251425 -0.199542 0.231174 0.015027 0.224227 -0.049374 0.135540 0.222974 0.085170 0.360198 -0.092049 -0.114264 -0.003703 0.032314 -0.026423
polarizability: 2.20873731e+02 -1.74338554e+00 1.45835043e+02 2.68271784e-01 1.02251120e+01 9.70878085e+01
1716.lowfreq: -0.0001 0.0004 0.0008 0.8546 2.9520 12.8124 18.2067 21.3207 29.3903
frequency: 17.9635 20.4261 29.3474 41.4712 52.8106 73.8024 98.6428 109.8744 124.8987 168.7392 182.1924 185.5707 201.9743 228.9075 233.0814 259.1832 278.2167 349.6627 385.5902 412.2433 455.2706 479.6502 502.6191 519.2130 553.3158 569.5495 610.4624 690.1731 693.6310 743.0191 759.0126 795.5255 809.1673 824.1195 878.7264 891.5481 917.5051 930.2820 959.2322 962.1346 982.8763 984.1386 1002.5511 1016.4369 1020.8619 1032.0955 1062.7778 1082.9362 1097.5066 1113.7003 1118.4158 1128.7881 1142.2970 1157.3299 1167.6535 1180.1300 1202.0895 1209.1033 1224.6088 1273.9597 1280.1177 1314.1546 1327.2332 1344.8771 1357.8497 1379.2363 1386.6150 1392.2256 1436.0505 1442.9339 1452.9693 1453.6884 1456.5854 1466.8409 1480.0033 1480.3503 1480.7557 1485.0279 1592.0153 1612.5726 1676.9188 2906.3896 2932.8278 2957.8013 2985.0193 3007.5299 3012.0775 3015.7571 3020.5820 3065.9636 3079.6448 3089.7259 3100.4322 3101.8606 3128.5889 3138.0254 3155.1227 3164.4754 3174.3221
redmass: 4.6383 3.6572 6.5942 4.8462 4.5849 2.5387 2.6732 3.5925 2.4566 2.5573 1.7067 2.7181 1.7523 4.0210 2.0340 4.1672 2.9539 4.9037 3.1149 2.9343 3.5487 3.2558 2.8854 3.4935 6.1191 3.5312 6.4179 5.4349 2.1061 2.2117 1.6463 6.7723 1.3871 1.2506 5.2987 1.4495 1.9863 5.2811 1.5109 1.3622 5.8132 1.3083 1.8904 3.3839 3.1040 3.4089 4.2029 1.5316 1.8236 1.3855 2.2070 3.0967 1.9217 1.4208 1.0761 1.1539 1.1045 1.4070 3.8139 1.1466 1.2771 1.3262 1.2159 1.3701 1.6425 1.7333 1.2585 4.5332 1.1308 2.1717 1.0977 1.1565 1.0611 1.0586 1.1251 1.4906 1.2105 1.0897 6.4168 6.3016 10.8612 1.0834 1.0351 1.0573 1.0364 1.0606 1.0991 1.0615 1.1018 1.1008 1.0986 1.1004 1.0977 1.1059 1.0848 1.0890 1.0925 1.0961 1.1000
irintensity: 0.0694 1.3060 0.1582 1.1763 0.5761 3.8795 2.5070 2.8943 2.1453 9.0488 1.4030 2.2452 2.7614 0.4295 3.9634 8.8491 7.8700 0.7950 18.3268 0.1658 0.8611 2.0295 12.6027 2.2679 0.4257 3.5453 0.4793 4.7222 36.4872 3.5378 92.3149 23.1589 6.4122 0.3761 2.8328 8.5983 4.0918 36.8163 1.1718 0.1306 3.0943 0.7474 0.3098 43.4591 19.2866 124.5176 114.7663 26.4923 28.8954 17.4317 155.3542 383.7306 28.1201 31.3693 2.6048 12.9198 28.5246 7.5945 148.5769 0.4748 3.0903 0.3674 13.3446 7.9595 41.0602 6.0996 19.8797 2.7771 2.9418 5.8124 9.2646 64.5772 15.4822 5.4591 34.4321 41.1262 25.4418 13.9089 28.7822 77.4694 181.5064 53.9950 84.9087 40.7368 16.1854 9.0757 68.1117 33.8614 19.3962 5.1708 39.2894 27.3855 23.9709 39.4417 2.9644 12.1794 37.0557 16.8704 5.4866
temp: 298.150 k
press: 1.00000 atm
elementType: 8 8 8 8 6 6 6 6 6 6 6 6 6 6 6 6 6 1 1 1 1 1 1 1 1 1 1 1 1 1 1 1 1 1 1
symmnumber: 1
zpe: 750861.1 jmol-1
zpe.correction: 0.285988 hartree
zpe.thermalcorrener: 0.304426 hartree
zpe.thermalcorrenthalpy: 0.305370 hartree
zpe.thermalcorrgfe: 0.235616 hartree
zpe.sumelectzpe: -805.736700 hartree
zpe.sumelectthermal: -805.718262 hartree
zpe.sumelectthermalent: -805.717318 hartree
zpe.sumelectthermalfe: -805.787072 hartree
dipole: 2.9913 2.7368 -0.5652
dipole: 4.0936
quadrupole: -72.9751 -102.3951 -103.1813
quadrupole: -4.8903 -6.3850 0.8233
quadrupole: 19.8754 -9.5446 -10.3308 -4.8903 -6.3850 0.8233
hfenergy: -806.022688 hartree
pointgroup: C01 [X(C13H18O4)]
dipole: 1.1736542 1.0793566 -0.2266801 debye
polarizability: 220.8813085|-1.4873937|146.0065947|0.8378768|9.768235|96.9086789 unknown
InChI: InChI=1S/C13H18O4/c1-11(15-2)8-9-16-13(14)10-17-12-6-4-3-5-7-12/h3-7,11H,8-10H2,1-2H3
charge 0 multiplicity 1
35 atoms
O  5.414978 -0.278756 0.934931
O  1.339325 0.311829 0.036608
O  -2.118347 -0.70864 -0.15067
O  0.426933 -1.83517 -0.134767
C  5.138439 0.440914 -0.32768
C  3.677711 0.914947 -0.21242
C  2.718125 -0.263499 -0.052667
C  6.113614 1.611817 -0.549582
C  6.633895 -1.085209 0.90986
C  0.287349 -0.606691 0.002991
C  -1.013072 0.170387 0.192624
C  -3.420031 -0.196012 0.012341
C  -3.719517 1.11363 0.462587
C  -4.460395 -1.100609 -0.314445
C  -5.073849 1.507256 0.582595
C  -5.801989 -0.691797 -0.18978
C  -6.118426 0.614867 0.259747
H  5.229445 -0.28288 -1.173122
H  3.588979 1.587539 0.660554
H  3.409856 1.495661 -1.114716
H  2.751382 -0.955847 -0.91438
H  2.927125 -0.833314 0.867468
H  5.860092 2.155648 -1.478298
H  6.058067 2.320191 0.296343
H  7.157448 1.263046 -0.642075
H  6.63439 -1.791071 0.051444
H  6.637317 -1.65779 1.850986
H  7.550759 -0.462925 0.863577
H  -1.073437 0.499686 1.251483
H  -0.991277 1.074257 -0.447961
H  -2.927994 1.825353 0.71633
H  -4.192807 -2.104759 -0.656967
H  -5.305958 2.520188 0.930636
H  -6.603591 -1.394563 -0.44273
H  -7.16304 0.928721 0.355452
