program: Gaussian 09
title: 000226931
version: EM64L-G09RevD.01
frameworkgroup: C1[X(C13H18O3)]
method: RPBEPBE
basis: SDD
operation: Freq
keyword: #pfreq=noraman
keyword: PBEPBE/SDD
title: #p freq=noraman PBEPBE/SDD
converged: YES YES NO NO
title: Mulliken charges:
elementType: O O O C C C C C C C C C C C C C H H H H H H H H H H H H H H H H H H
charge: -0.294878 -0.293173 -0.266243 0.065202 -0.423552 -0.280014 -0.709408 0.061547 0.374209 0.196394 -0.326909 -0.506145 -0.404077 -0.784740 -0.240855 -0.220100 0.192123 0.213768 0.203694 0.259363 0.233214 0.217342 0.224497 0.214063 0.275433 0.199717 0.234507 0.202974 0.230133 0.240340 0.232831 0.213430 0.234877 0.230436
chargesum: 0.00000
title: Mulliken charges with hydrogens summed into heavy atoms:
elementType: O O O C C C C C C C C C C C C C
charge: -0.294878 -0.293173 -0.266243 0.257326 -0.006090 0.212563 -0.053506 0.061547 0.374209 0.196394 -0.051477 0.131052 -0.173943 -0.098139 -0.005978 0.010336
polarizability: 1.97415013e+02 4.83329453e+00 1.53424696e+02 -1.61006133e+01 5.69725703e+00 1.03850474e+02
1716.lowfreq: -9.9380 -0.0003 -0.0001 0.0004 3.8328 6.4164 13.4849 25.3696 36.5676
frequency: 11.8764 25.1438 36.5505 49.4925 80.0972 100.3529 127.5754 157.1773 193.2141 202.7944 209.3661 220.4830 248.4289 264.5856 276.5614 292.5961 347.5279 358.9970 410.1529 434.9542 465.6161 493.4114 496.0602 522.7085 542.6478 646.2802 680.5576 729.3556 737.4536 775.0049 789.3199 812.2996 834.3002 856.9116 886.3715 915.9846 968.3183 975.7828 994.8395 1004.5505 1019.8669 1039.3807 1046.0449 1047.5568 1066.7402 1097.4439 1108.4978 1115.0463 1115.9860 1139.5140 1156.1937 1176.4446 1205.7494 1210.9934 1233.6296 1259.1769 1285.2333 1301.1717 1333.1460 1355.1340 1371.4577 1374.3684 1379.7619 1402.2532 1429.3749 1433.0841 1437.1643 1457.2070 1459.4003 1465.5944 1467.2331 1472.6900 1476.7806 1478.3283 1480.4964 1570.4796 1595.5766 1616.1660 2928.5828 2940.5968 2981.6746 2991.7210 2999.5398 3005.6249 3023.8705 3060.4879 3077.1671 3078.5936 3086.5926 3090.7090 3096.9585 3097.7379 3123.0736 3139.0671 3152.9171 3168.8880
redmass: 3.5374 4.2152 6.0361 3.2650 2.7260 3.8250 3.6323 3.6561 1.3763 1.2432 1.1850 1.7640 3.0489 2.6135 3.7829 2.6211 4.3259 2.9210 3.2267 3.2854 2.4818 3.7013 3.3066 3.3478 5.5831 6.3560 4.6124 2.6240 1.9136 5.3285 1.8951 3.1218 3.7146 2.5413 1.3092 1.9501 1.5697 1.3774 1.6522 1.3422 2.9458 3.4784 2.2805 2.1532 2.9646 1.9427 2.3155 1.3120 1.7828 1.8699 1.4513 1.0683 1.1751 2.4626 3.0023 1.3491 1.4998 1.2464 1.2266 1.4384 1.7660 4.8700 1.2476 1.2769 1.9857 1.1068 1.1271 1.0559 1.0485 1.0559 1.1548 1.1752 2.0508 1.0663 1.0548 7.3839 8.4151 6.7445 1.0359 1.0818 1.0362 1.0361 1.0599 1.1016 1.0593 1.1006 1.0985 1.0964 1.1002 1.1007 1.1069 1.0975 1.0864 1.0899 1.0939 1.0999
irintensity: 0.1022 0.0834 1.5276 0.8538 5.0222 2.6484 1.0715 1.3988 3.7464 3.3225 1.5877 2.5545 0.3466 4.5128 3.3381 6.9759 3.4943 2.0667 17.9561 0.9960 1.6310 1.6330 5.5437 3.1369 1.0107 3.1771 15.0530 8.1645 50.6359 1.9177 25.7389 1.8144 5.2556 6.6058 0.6273 22.1217 1.6083 0.9502 2.4540 0.2889 32.8972 172.5636 34.7750 73.2836 64.9329 11.1618 19.5560 5.2859 74.2486 47.5275 4.0996 1.4621 2.3800 3.1136 255.8621 1.8694 50.9661 1.4433 16.1057 5.6970 18.3326 15.8272 20.1627 13.4342 28.6466 12.3870 0.0570 10.1912 13.3479 4.5311 5.4716 33.1995 9.8940 5.1724 16.9937 37.4094 154.6301 48.4009 66.5699 60.5644 15.4132 21.9888 21.3157 87.7238 19.2135 17.1537 46.6157 15.3823 34.2967 24.5751 22.1331 27.2367 5.1554 17.4835 13.4556 25.7692
temp: 298.150 k
press: 1.00000 atm
elementType: 8 8 8 6 6 6 6 6 6 6 6 6 6 6 6 6 1 1 1 1 1 1 1 1 1 1 1 1 1 1 1 1 1 1
symmnumber: 1
zpe: 741085.8 jmol-1
zpe.correction: 0.282265 hartree
zpe.thermalcorrener: 0.299478 hartree
zpe.thermalcorrenthalpy: 0.300422 hartree
zpe.thermalcorrgfe: 0.234652 hartree
zpe.sumelectzpe: -730.622814 hartree
zpe.sumelectthermal: -730.605601 hartree
zpe.sumelectthermalent: -730.604657 hartree
zpe.sumelectthermalfe: -730.670427 hartree
dipole: 0.5831 -3.6640 -0.0672
dipole: 3.7107
quadrupole: -85.1310 -98.5725 -93.0876
quadrupole: -0.2012 -1.6517 -1.3867
quadrupole: 7.1327 -6.3088 -0.8239 -0.2012 -1.6517 -1.3867
hfenergy: -730.9050789 hartree
pointgroup: C01 [X(C13H18O3)]
dipole: 0.1942526 1.3325636 0.5637553 debye
polarizability: 198.9502434|-7.4704722|141.5432629|9.2101913|22.2373262|114.1966768 unknown
InChI: InChI=1S/C13H18O3/c1-10-6-4-5-7-12(10)13(14)16-9-8-11(2)15-3/h4-7,11H,8-9H2,1-3H3
charge 0 multiplicity 1
34 atoms
O  3.814035 0.108328 -1.073633
O  0.502453 -0.741835 0.348703
O  -0.649661 -2.375775 -0.826096
C  3.27893 0.484256 0.253635
C  2.86752 -0.847663 0.907636
C  1.741759 -1.566049 0.167572
C  4.318441 1.249752 1.092285
C  -1.887315 -0.438333 -0.014537
C  -1.952941 0.815773 0.677643
C  -0.659118 -1.276108 -0.213003
C  -3.067482 -0.993068 -0.587606
C  3.914954 1.222343 -2.013427
C  -3.220275 1.453127 0.760268
C  -0.768702 1.511534 1.326395
C  -4.308509 -0.339828 -0.491552
C  -4.384466 0.895961 0.190354
H  2.373838 1.115944 0.105783
H  3.753295 -1.512696 0.914832
H  2.572571 -0.670385 1.95882
H  1.956096 -1.647163 -0.911361
H  1.546273 -2.57461 0.572749
H  4.62511 2.190942 0.601961
H  5.220158 0.629632 1.245018
H  3.900114 1.50957 2.082482
H  -2.972856 -1.951751 -1.1077
H  2.940939 1.745304 -2.127152
H  4.204703 0.779654 -2.979851
H  4.685259 1.96141 -1.710697
H  -3.287906 2.412079 1.287329
H  -0.293449 0.875716 2.092763
H  0.02045 1.737752 0.588186
H  -1.093338 2.455404 1.797488
H  -5.202569 -0.785659 -0.939805
H  -5.341412 1.422741 0.278516
