program: Gaussian 09
title: 000226916
version: EM64L-G09RevD.01
frameworkgroup: C1[X(C12H17NO)]
method: RPBEPBE
basis: SDD
operation: Freq
keyword: #p
keyword: freq=noraman
keyword: PBEPBE/SDD
title: #p freq=noraman PBEPBE/SDD
converged: YES YES NO NO
title: Mulliken charges:
elementType: O N C C C C C C C C C C C C H H H H H H H H H H H H H H H H H
charge: -0.273548 -0.368685 -0.338250 -0.397276 -0.349583 0.155841 0.132186 -0.684898 0.315341 -0.384498 -0.411950 -0.798383 -0.246391 -0.222554 0.229471 0.194741 0.205358 0.253249 0.188598 0.198648 0.312211 0.214088 0.215453 0.209194 0.248042 0.233594 0.210901 0.227049 0.272472 0.230403 0.229175
chargesum: 0.00000
title: Mulliken charges with hydrogens summed into heavy atoms:
elementType: O N C C C C C C C C C C C C
charge: -0.273548 -0.056474 0.085962 0.061331 0.037663 0.155841 0.132186 -0.046163 0.315341 -0.136456 -0.178356 -0.087961 -0.015988 0.006621
polarizability: 1.71909696e+02 -7.04305707e-01 1.39776734e+02 -2.08739262e+01 4.17237462e+00 1.02423629e+02
1716.lowfreq: -16.0431 -10.2908 -1.8835 -0.0008 -0.0005 0.0003 8.1003 36.1764 55.8447
frequency: 6.3134 36.1366 55.8396 61.3680 105.2670 113.3221 121.0806 186.3835 207.2123 228.7808 233.2573 267.8984 299.0853 367.7304 374.7048 410.1152 465.4659 494.4690 540.9865 551.3738 560.5243 650.0056 695.9244 735.7698 743.1915 756.7611 782.0488 799.0545 845.6066 850.4130 878.8310 937.3128 953.6454 969.6254 991.1063 992.9406 1026.5710 1047.7652 1048.4665 1062.4314 1111.2589 1121.4363 1133.2601 1155.0255 1175.7274 1210.6124 1225.3442 1251.6482 1271.9487 1282.1244 1285.2980 1310.7716 1345.9332 1365.5462 1371.2307 1389.8401 1403.4033 1423.4655 1442.5147 1454.7229 1459.9121 1468.3423 1472.8822 1475.6104 1477.4264 1485.4624 1488.3845 1574.5650 1593.2084 1611.4919 2959.8270 2974.2982 2978.9424 2988.6877 2995.7621 3006.7273 3047.0574 3071.0820 3072.8444 3073.3951 3074.5933 3095.4247 3120.7259 3126.6500 3142.0062 3162.2576 3556.5145
redmass: 3.5148 4.1997 5.4883 1.5819 1.7792 3.4484 1.4923 2.8623 3.2316 1.7122 1.7848 3.3403 2.7794 4.2338 3.4272 3.1333 2.9487 2.6741 3.6415 1.6369 2.1446 5.6573 4.0878 1.3015 1.6053 2.8156 2.3317 2.9362 1.9378 2.0746 1.3073 1.6873 1.3848 1.6656 1.3391 1.5955 3.6339 1.7135 2.0047 2.4233 2.2069 1.9611 1.9757 2.2120 1.0622 2.5203 1.3421 1.6018 1.7350 1.4493 1.1134 1.2539 1.4795 1.4651 5.3650 1.2124 1.2387 1.9136 1.1898 1.0627 1.0899 1.8151 1.0846 1.1635 1.0465 1.0934 2.1468 6.4757 6.2752 6.4146 1.0592 1.0366 1.0617 1.0372 1.0642 1.0972 1.1000 1.1004 1.0964 1.1007 1.1005 1.1001 1.0853 1.0891 1.0938 1.1009 1.0778
irintensity: 0.6677 0.7034 6.7481 0.1440 1.3852 1.4444 0.4243 3.5709 1.9542 1.3301 2.3239 0.9598 4.8667 1.3105 6.1290 7.1913 10.3645 3.6636 0.1263 66.4930 44.2261 8.5867 13.9455 17.5761 43.4215 5.9054 24.4559 0.7386 1.7896 3.7047 0.2617 12.4025 0.2004 12.5787 0.0597 0.4693 2.4931 9.0653 7.5127 2.5402 5.7619 9.2965 1.3621 9.7556 0.7753 2.8414 2.4144 18.5139 97.1336 7.8572 1.9178 37.0305 1.8765 1.4396 3.0632 9.5931 22.5430 7.5099 53.6572 21.6516 4.8454 65.1599 8.3353 61.5370 21.9213 12.3894 133.3518 47.9705 63.8959 44.1639 29.3301 28.6448 48.4896 23.8836 44.3169 8.1673 39.5915 66.5426 22.3025 14.0073 62.5905 13.9984 6.4357 3.8375 31.5387 29.0630 14.6522
temp: 298.150 k
press: 1.00000 atm
elementType: 8 7 6 6 6 6 6 6 6 6 6 6 6 6 1 1 1 1 1 1 1 1 1 1 1 1 1 1 1 1 1
symmnumber: 1
zpe: 692278.8 jmol-1
zpe.correction: 0.263675 hartree
zpe.thermalcorrener: 0.278658 hartree
zpe.thermalcorrenthalpy: 0.279602 hartree
zpe.thermalcorrgfe: 0.218691 hartree
zpe.sumelectzpe: -596.411571 hartree
zpe.sumelectthermal: -596.396589 hartree
zpe.sumelectthermalent: -596.395644 hartree
zpe.sumelectthermalfe: -596.456555 hartree
dipole: -0.5640 -2.1787 -2.6666
dipole: 3.4893
quadrupole: -75.4569 -78.7459 -92.3836
quadrupole: 2.5944 -3.8762 -3.0634
quadrupole: 6.7386 3.4496 -10.1882 2.5944 -3.8762 -3.0634
hfenergy: -596.6752463 hartree
pointgroup: C01 [X(C12H17N1O1)]
dipole: -0.1417642 0.177449 -1.3538872 debye
polarizability: 171.6785471|17.2336158|117.5578334|-12.7333267|18.4831852|124.8736786 unknown
InChI: InChI=1S/C12H17NO/c1-3-4-9-13-12(14)11-8-6-5-7-10(11)2/h5-8,13H,3-4,9H2,1-2H3
charge 0 multiplicity 1
31 atoms
O  -0.474838 -0.684474 1.877855
N  -1.055422 -0.96323 -0.356161
C  -3.475777 -0.402289 0.113578
C  -2.39394 -1.497603 -0.044448
C  -3.761837 0.392934 -1.180323
C  1.174131 -0.094286 0.159515
C  -0.167548 -0.590918 0.645923
C  -4.857883 1.463286 -0.986208
C  1.81576 1.016683 0.79093
C  1.822825 -0.77798 -0.903256
C  3.087529 1.413376 0.30593
C  1.175842 1.774774 1.939577
C  3.093958 -0.372665 -1.362783
C  3.726797 0.734246 -0.755702
H  -3.163117 0.286391 0.921693
H  -4.4108 -0.89089 0.456725
H  -2.680698 -2.205316 -0.846143
H  -2.301928 -2.059369 0.901517
H  -4.067797 -0.309683 -1.983482
H  -2.829962 0.884631 -1.526683
H  -0.813466 -0.756439 -1.326149
H  -4.561412 2.193953 -0.210583
H  -5.05124 2.020567 -1.921109
H  -5.809837 1.000966 -0.663729
H  1.345497 -1.65999 -1.346858
H  3.584498 2.271143 0.774368
H  1.789477 2.647234 2.222892
H  0.162435 2.131731 1.678857
H  1.048054 1.11876 2.817206
H  3.58616 -0.918986 -2.174657
H  4.713537 1.063542 -1.100193
