program: Gaussian 09
title: 000226914
version: EM64L-G09RevD.01
frameworkgroup: C1[X(C12H16O2)]
method: RPBEPBE
basis: SDD
operation: Freq
keyword: #pfreq=noraman
keyword: PBEPBE/SDD
title: #p freq=noraman PBEPBE/SDD
converged: YES YES NO NO
title: Mulliken charges:
elementType: O O C C C C C C C C C C C C H H H H H H H H H H H H H H H H
charge: -0.304574 -0.272699 0.066449 -0.378230 -0.708716 -0.689448 0.065729 0.368771 0.192037 -0.328793 -0.402772 -0.782536 -0.240976 -0.220270 0.229451 0.206576 0.196545 0.216265 0.253366 0.212981 0.230546 0.212244 0.216058 0.275017 0.230378 0.240671 0.211724 0.239467 0.234499 0.230239
chargesum: 0.00000
title: Mulliken charges with hydrogens summed into heavy atoms:
elementType: O O C C C C C C C C C C C C
charge: -0.304574 -0.272699 0.295900 0.024891 -0.026103 -0.030601 0.065729 0.368771 0.192037 -0.053776 -0.172394 -0.090674 -0.006477 0.009969
polarizability: 1.86209055e+02 1.10078044e+00 1.35387470e+02 6.77957899e+00 -1.14431969e+01 8.89901749e+01
1716.lowfreq: -12.1133 -0.0009 -0.0004 0.0005 2.7870 7.2502 21.4685 42.4493 64.7504
frequency: 20.2126 42.3989 64.7018 100.1070 107.3267 137.5868 179.6883 189.1603 202.8725 211.8942 231.2850 275.5608 305.5018 353.9830 381.3211 413.9754 431.9417 476.6537 500.4499 509.0374 542.0974 642.7513 680.7489 737.6223 748.2576 767.6571 789.8900 813.3413 826.3830 865.0661 886.1867 964.9639 975.9549 991.6456 995.5542 1004.3376 1036.0484 1037.3271 1046.4399 1064.9524 1107.7624 1116.3529 1129.0393 1176.1093 1178.8102 1210.5961 1231.7568 1261.3433 1283.7832 1296.3176 1331.0715 1357.2773 1373.0972 1383.0156 1388.1493 1403.1465 1429.5366 1452.0575 1458.7644 1464.7433 1469.4622 1474.3891 1475.9885 1478.2023 1485.2857 1568.5767 1592.6784 1615.4689 2981.7579 2984.2907 2989.6152 2992.4950 3019.1047 3040.2167 3076.9949 3080.5678 3084.7107 3088.7000 3090.1806 3102.1486 3123.2731 3138.5901 3152.9167 3168.4873
redmass: 3.5110 4.0923 4.3780 3.7573 1.8647 3.3276 1.0847 2.0592 1.0756 1.5627 2.9815 3.4804 4.2220 3.7573 3.1277 3.0137 3.2867 3.0518 3.3358 3.8951 5.3938 6.3543 4.6540 1.8978 1.8157 5.2597 1.9150 1.9955 3.8059 2.3011 1.3101 1.2624 1.3781 1.4184 1.6593 1.3415 3.3781 3.3905 1.5726 2.7666 1.8347 1.7829 2.1934 1.0749 1.9660 2.4992 2.6813 1.2507 1.4665 1.3289 1.3088 1.7083 6.1347 1.2249 1.2160 1.2798 2.0196 1.0782 1.0469 1.0604 1.2227 1.0710 2.0855 1.0546 1.0569 7.6030 8.3115 6.5944 1.0425 1.0498 1.0399 1.0363 1.0878 1.0983 1.0997 1.0964 1.0988 1.0998 1.1008 1.1004 1.0863 1.0898 1.0940 1.0999
irintensity: 0.1520 1.9931 0.2621 0.6648 0.6446 1.2559 0.4270 1.7517 0.3819 0.8163 1.7342 4.7636 1.3191 4.8676 6.4127 2.6853 1.1685 0.4057 6.7122 0.4132 1.3572 3.6238 15.2682 49.8461 4.1398 1.5365 24.8034 17.1789 5.8844 25.3257 0.6206 8.5220 0.9167 44.7948 4.7063 0.3026 80.7760 133.3923 10.3740 61.3178 32.2043 50.4234 8.2765 3.0596 20.4095 3.5745 239.4180 7.5000 47.2815 4.9727 5.4137 3.4643 21.2176 20.3536 19.5323 13.7335 22.9290 4.1799 12.5099 11.7613 22.2102 11.9989 9.3096 18.7391 8.5428 46.1117 141.5295 36.6671 34.1231 12.7350 35.7524 23.0224 3.7742 16.4371 35.5479 13.1916 22.0803 91.1919 17.6798 19.0574 4.9364 17.5276 14.2766 25.6901
temp: 298.150 k
press: 1.00000 atm
elementType: 8 8 6 6 6 6 6 6 6 6 6 6 6 6 1 1 1 1 1 1 1 1 1 1 1 1 1 1 1 1
symmnumber: 1
zpe: 657107.0 jmol-1
zpe.correction: 0.250279 hartree
zpe.thermalcorrener: 0.265061 hartree
zpe.thermalcorrenthalpy: 0.266005 hartree
zpe.thermalcorrgfe: 0.207483 hartree
zpe.sumelectzpe: -616.282598 hartree
zpe.sumelectthermal: -616.267816 hartree
zpe.sumelectthermalent: -616.266872 hartree
zpe.sumelectthermalfe: -616.325393 hartree
dipole: -0.4409 2.1176 -0.6441
dipole: 2.2569
quadrupole: -68.5588 -86.0893 -85.9689
quadrupole: 0.0571 1.3093 -0.6074
quadrupole: 11.6469 -5.8836 -5.7632 0.0571 1.3093 -0.6074
hfenergy: -616.5328769 hartree
pointgroup: C01 [X(C12H16O2)]
dipole: -0.1000773 0.3024281 0.8288325 debye
polarizability: 185.0247858|-11.9392892|91.4178967|-1.0575599|14.2429288|134.1440172 unknown
InChI: InChI=1S/C12H16O2/c1-4-10(3)14-12(13)11-8-6-5-7-9(11)2/h5-8,10H,4H2,1-3H3
charge 0 multiplicity 1
30 atoms
O  -1.280453 0.198653 0.058697
O  -0.735946 -0.531778 -2.080156
C  -2.735346 0.239975 -0.344506
C  -3.532083 0.006686 0.948124
C  -3.015185 1.589885 -1.01887
C  -3.309345 -1.389173 1.565603
C  1.058673 -0.215323 -0.461644
C  1.537725 0.20706 0.822649
C  -0.369695 -0.202709 -0.919946
C  1.97786 -0.697909 -1.436979
C  2.935753 0.117415 1.061045
C  0.663373 0.745616 1.941826
C  3.356047 -0.777789 -1.172524
C  3.838678 -0.365887 0.090614
H  -2.893339 -0.584738 -1.065313
H  -3.264648 0.79541 1.678254
H  -4.604711 0.145783 0.706434
H  -2.801441 2.424563 -0.327394
H  -2.397876 1.707544 -1.924917
H  -4.077979 1.649353 -1.317481
H  -2.24454 -1.540839 1.815343
H  -3.609168 -2.188954 0.862782
H  -3.900303 -1.512639 2.491006
H  1.570337 -1.005442 -2.405402
H  3.318977 0.43778 2.036977
H  -0.084716 0.001387 2.265143
H  1.285802 1.022982 2.81014
H  0.088568 1.630595 1.619394
H  4.043774 -1.153857 -1.937169
H  4.909206 -0.418247 0.319269
