program: Gaussian 09
title: 000226901
version: EM64L-G09RevD.01
frameworkgroup: C1[X(C10H13NO)]
method: RPBEPBE
basis: SDD
operation: Freq
keyword: #p
keyword: freq=noraman
keyword: PBEPBE/SDD
title: #p freq=noraman PBEPBE/SDD
converged: YES YES NO NO
title: Mulliken charges:
elementType: O N C C C C C C C C C C H H H H H H H H H H H H H
charge: -0.285760 -0.126457 0.155603 0.298232 0.131787 -0.324681 -0.415047 -0.809974 -0.254128 -0.226156 -0.614102 -0.619235 0.241141 0.233325 0.274107 0.214915 0.223133 0.230463 0.227912 0.221369 0.282254 0.221842 0.266775 0.227490 0.225194
chargesum: 0.00000
title: Mulliken charges with hydrogens summed into heavy atoms:
elementType: O N C C C C C C C C C C
charge: -0.285760 -0.126457 0.155603 0.298232 0.131787 -0.083540 -0.181722 -0.097819 -0.023666 0.001756 0.111362 0.100223
polarizability: 1.49841920e+02 1.92794322e+00 1.21129995e+02 -1.05793017e+00 4.86758361e+00 7.66718164e+01
1716.lowfreq: -9.1038 -0.0008 -0.0005 0.0002 3.6335 10.2837 43.9089 81.3512 99.0520
frequency: 43.8386 81.3351 99.0496 125.4571 135.9094 142.8262 194.0880 203.4967 262.6800 275.9151 323.4064 375.8629 387.6027 416.9744 469.1137 529.9866 559.6037 624.8395 679.7986 709.8332 742.2738 778.3994 793.4080 878.7744 908.1478 953.9959 989.7813 990.8746 1039.9374 1046.8581 1050.1938 1055.3057 1094.3433 1124.7162 1144.8071 1174.7004 1198.8458 1224.0557 1245.0864 1282.0586 1367.9358 1380.3905 1400.1289 1409.5361 1425.2458 1439.2644 1459.0806 1469.6790 1470.2616 1475.5588 1482.3789 1488.3193 1504.3141 1561.1885 1584.7130 1609.5881 2959.0092 2967.5235 2983.9397 3026.9469 3040.8997 3066.9214 3092.2241 3116.4202 3120.0462 3123.3435 3126.4133 3141.2429 3161.6009
redmass: 4.2867 2.7135 3.8100 1.0883 1.2434 1.1433 3.1148 2.5283 2.5881 4.1346 3.4407 4.3494 2.7239 3.0629 2.9450 5.0465 4.0626 6.1813 4.8284 7.3179 1.7324 2.1377 4.5946 1.3223 3.8542 1.4002 1.3394 1.5822 2.2842 1.6294 1.4528 2.0434 1.2238 1.5923 1.3840 1.0616 2.8309 2.8479 4.6054 1.4653 6.6927 3.0697 1.2399 1.2005 1.8220 1.2513 1.0614 1.0444 1.0832 1.4693 1.5615 1.0474 1.3176 5.9239 6.4728 6.1342 1.0375 1.0364 1.0372 1.1012 1.1012 1.0961 1.1004 1.0972 1.0858 1.0944 1.0896 1.0940 1.1008
irintensity: 3.9465 0.0509 2.4415 1.0400 0.0105 0.3164 1.9143 1.8667 7.6058 1.3460 2.8518 14.6632 0.8045 4.6596 5.0218 1.0788 5.1770 7.5694 5.0110 6.9656 42.6945 40.3137 1.3909 0.5237 1.6978 2.4962 0.0188 0.9328 60.8047 4.5344 10.9756 73.0798 0.1349 9.6450 0.5082 0.3141 35.2688 8.5469 51.6117 2.7433 8.1192 97.1776 24.0446 44.2397 5.8735 15.0677 23.8016 4.2254 20.9765 24.3341 10.2713 21.8995 23.4748 207.0010 28.3387 10.2671 44.0433 109.0180 22.8060 39.1341 33.2626 17.3388 17.0932 1.6061 10.2003 9.1942 2.3206 31.8363 28.4430
temp: 298.150 k
press: 1.00000 atm
elementType: 8 7 6 6 6 6 6 6 6 6 6 6 1 1 1 1 1 1 1 1 1 1 1 1 1
symmnumber: 1
zpe: 543178.2 jmol-1
zpe.correction: 0.206886 hartree
zpe.thermalcorrener: 0.219335 hartree
zpe.thermalcorrenthalpy: 0.220279 hartree
zpe.thermalcorrgfe: 0.168136 hartree
zpe.sumelectzpe: -517.951849 hartree
zpe.sumelectthermal: -517.939400 hartree
zpe.sumelectthermalent: -517.938456 hartree
zpe.sumelectthermalfe: -517.990599 hartree
dipole: 0.3729 -2.6231 2.7658
dipole: 3.8300
quadrupole: -61.0716 -69.2101 -76.0767
quadrupole: -4.6778 2.9768 4.9162
quadrupole: 7.7146 -0.4240 -7.2906 -4.6778 2.9768 4.9162
hfenergy: -518.1587344 hartree
pointgroup: C01 [X(C10H13N1O1)]
dipole: 0.0361182 0.5905136 -1.3858585 debye
dipolederiv: -0.7724687 0.0908882 -0.1646995 -0.0457358 -0.5408204 0.3236152 0.1628938 0.3263922 -0.9443247 -0.8580608 -0.1852908 0.3372504 -0.1731047 -0.4481704 0.2470902 0.2609174 0.2332485 -0.7137184 -0.1743751 -0.0033055 -0.016912 0.0768445 -0.1203322 0.0439517 0.0402131 0.0338631 -0.0769055 -0.0015066 -0.1827341 0.0083059 -0.0758387 0.3425298 -0.0285938 -0.0332985 -0.0587823 -0.0144297 1.4006485 0.1516495 -0.2986086 0.2508586 0.4589061 -0.591375 -0.5897495 -0.5491427 1.1218459 -0.0273413 0.057468 0.0114793 -0.0412022 0.0218913 0.0002061 0.0997184 -0.0042932 -0.135931 -0.0357221 0.2190332 0.0133428 0.0938378 -0.0632426 0.0089267 0.0267437 0.0231987 -0.1680642 0.0136221 0.168246 -0.0155921 0.1035416 -0.1168161 0.0389402 -0.0367853 0.0797707 0.0101074 -0.1012416 -0.083321 0.0144347 -0.0663816 0.0414738 -0.0038654 0.0155322 -0.0054531 -0.1658953 0.100274 -0.0147139 0.0341219 0.0146274 0.0235012 -0.0035394 0.0192734 -0.0049205 -0.140646 0.4530076 0.0384997 -0.0613972 -0.0848244 0.2024057 0.1205476 0.1115193 0.1230598 -0.0024167 -0.0313071 -0.0496026 0.029027 0.0365699 0.3339673 -0.1108605 -0.0967113 -0.086078 0.43029 0.0128572 -0.1110907 -0.0120049 -0.0949881 -0.0301777 0.0038755 -0.0253483 0.0036736 0.1338573 0.0014391 -0.0833191 -0.0098409 -0.1211082 -0.0592333 -0.0073871 -0.0126958 -0.0074108 0.1497548 0.1119026 0.0429702 -0.0710508 0.0393264 0.0682638 -0.0068157 -0.0507005 0.0475315 -0.0189305 -0.0655681 -0.1786373 -0.023037 -0.0692677 -0.0369883 -0.0146665 -0.0316737 -0.0490399 0.1075772 -0.0123236 0.058153 0.1148561 0.0329532 0.0339984 0.0032856 0.1234179 -0.0497047 -0.0031168 0.0404115 0.0652439 -0.0103491 0.0887547 -0.0974494 0.0096241 -0.0204054 0.0103978 0.1602094 -0.1332784 0.0369046 -0.0303035 0.0302359 0.0800275 0.0038488 -0.0354123 0.0057564 0.1527679 -0.0744971 0.0220386 0.0553143 0.0991055 0.0105659 -0.1095019 0.1300274 -0.1201611 -0.0223187 0.1758529 -0.0005589 0.0120579 0.06672 0.1124311 0.0527752 -0.1038122 0.0320285 0.0043866 -0.055591 -0.0557721 0.0165212 -0.1475067 -0.1333332 -0.0010822 0.0259107 0.0212972 0.1240005 -0.0458482 -0.0076137 -0.0987083 -0.0270866 0.0752361 0.0071558 -0.0921039 -0.0004254 0.1067633 -0.0140657 0.0544044 0.1532417 0.0874953 0.0183374 -0.0874639 0.1091557 -0.0056925 -0.1001773 0.0931797 -0.0495397 0.0125507 -0.0738263 -0.1769716 0.1013085 0.0033735 0.0008863 0.0053143 unknown
polarizability: 149.9568557|0.3612492|118.7612764|-0.9471061|-10.9109735|78.9255998 unknown
InChI: InChI=1S/C10H13NO/c1-8-6-4-5-7-9(8)10(12)11(2)3/h4-7H,1-3H3
charge 0 multiplicity 1
25 atoms
O  1.61964 -0.818496 1.447957
N  2.162288 0.336553 -0.50273
C  -0.231588 -0.022762 0.099985
C  -1.10193 -1.153314 0.048677
C  1.241458 -0.20957 0.393262
C  -0.76439 1.288763 0.0114
C  -2.48975 -0.921074 -0.122046
C  -0.57229 -2.570055 0.177748
C  -2.151579 1.500533 -0.138912
C  -3.017786 0.386986 -0.212356
C  3.595941 0.274903 -0.171907
C  1.835061 0.864745 -1.836231
H  -0.086125 2.147923 0.078414
H  -3.165926 -1.782682 -0.175984
H  -0.137539 -2.728691 1.180212
H  -1.375079 -3.308792 0.012959
H  0.237564 -2.771882 -0.548154
H  -2.549402 2.519557 -0.194897
H  -4.096894 0.534045 -0.333821
H  4.136423 -0.379755 -0.883353
H  3.699566 -0.137037 0.843344
H  4.044519 1.285855 -0.213231
H  0.770703 0.711046 -2.063124
H  2.437961 0.340841 -2.604055
H  2.058854 1.947661 -1.905858
