program: Gaussian 09
title: 000226896
version: EM64L-G09RevD.01
frameworkgroup: C1[X(C9H18O2)]
method: RPBEPBE
basis: SDD
operation: Freq
keyword: #pfreq=noraman
keyword: PBEPBE/SDD
title: #p freq=noraman PBEPBE/SDD
converged: YES YES NO NO
title: Mulliken charges:
elementType: O O C C C C C C C C C H H H H H H H H H H H H H H H H H H
charge: -0.284362 -0.247668 -0.161881 -0.367231 -0.355072 -0.720828 0.234161 0.043604 -0.694828 -0.687875 -0.684734 0.232603 0.211355 0.190116 0.210675 0.198322 0.216699 0.232422 0.223899 0.231938 0.210735 0.208037 0.217706 0.208129 0.231258 0.221935 0.211878 0.251578 0.217430
chargesum: 0.00000
title: Mulliken charges with hydrogens summed into heavy atoms:
elementType: O O C C C C C C C C C
charge: -0.284362 -0.247668 0.070722 0.034240 0.053925 -0.047809 0.234161 0.275542 -0.058350 -0.026553 -0.003848
polarizability: 1.13917474e+02 3.72560029e+00 1.02807011e+02 1.17605595e+00 -5.59684891e-01 9.53712802e+01
1716.lowfreq: -14.6745 -7.8859 0.0003 0.0004 0.0006 3.3653 21.2360 48.7304 69.0148
frequency: 20.6271 48.6408 69.0136 79.4033 103.7262 138.6110 154.5031 191.7218 210.2217 218.6716 229.1866 242.8637 255.9833 324.6461 354.6314 382.7622 410.7349 449.7131 525.0649 572.5996 712.5401 743.9032 773.3528 821.9478 868.5324 879.5636 906.0850 925.9638 939.6072 944.0877 994.3323 1022.5895 1054.4148 1069.5962 1102.2056 1113.7592 1153.4205 1157.6276 1181.2064 1203.8337 1240.2614 1275.8729 1292.3531 1310.8482 1321.2159 1322.5047 1337.1298 1350.6797 1379.7954 1384.6844 1388.9409 1395.3475 1456.3103 1457.5450 1464.9365 1470.8144 1471.9876 1472.5270 1478.5644 1480.9637 1485.7164 1487.4536 1624.1142 2967.6547 2972.3637 2976.8474 2983.4931 2987.2298 2991.0676 3010.1775 3018.1353 3024.2675 3047.1295 3069.2921 3073.1463 3078.5934 3081.9810 3091.1555 3093.5969 3096.4870 3102.2899
redmass: 3.2904 3.0956 4.9242 1.8196 2.8298 3.0076 2.3906 1.0332 1.1648 2.3467 1.3145 1.1166 2.1845 2.7197 2.7365 3.5378 3.3794 2.7319 3.4038 2.8349 3.7028 1.2925 3.8676 3.0938 1.3835 1.7408 2.3258 1.2256 1.7467 1.6063 1.6151 1.7023 2.1622 2.9369 1.6774 2.2852 2.2560 2.0941 2.0097 2.3912 1.4752 1.2712 1.1374 1.3673 1.4326 1.3184 1.3501 1.5168 1.2583 1.2124 1.2128 1.2327 1.0542 1.0722 1.0486 1.0623 1.0503 1.0536 1.0429 1.0561 1.0659 1.0516 10.1312 1.0578 1.0382 1.0598 1.0354 1.0355 1.0359 1.0949 1.0898 1.0864 1.1009 1.1010 1.0993 1.1000 1.0994 1.0988 1.1003 1.1005 1.1005
irintensity: 0.2704 0.4416 0.6196 0.3882 1.3018 2.8747 0.5530 0.0165 0.3069 0.4830 0.6697 0.3873 3.9176 1.7954 0.4710 3.2038 4.9312 4.8158 3.7744 0.1178 2.7884 7.5701 5.2455 3.3419 2.2174 5.4876 8.3180 2.3075 17.1695 9.8936 68.5558 73.7228 89.1049 37.3220 61.6496 3.9309 4.7595 9.6391 35.6990 66.9816 35.7634 19.1551 1.4389 2.7542 1.8876 3.2772 2.9734 2.1232 27.4411 14.4665 12.7760 17.7576 5.6804 2.1642 7.3913 2.4307 2.6610 12.5804 19.7383 7.7512 6.0179 31.2548 177.0933 10.1336 27.3455 59.7715 38.0625 15.5521 21.1072 6.4409 4.3837 7.4817 21.0829 86.8492 46.3773 37.6837 5.7226 58.4967 34.8137 21.8384 30.7438
temp: 298.150 k
press: 1.00000 atm
elementType: 8 8 6 6 6 6 6 6 6 6 6 1 1 1 1 1 1 1 1 1 1 1 1 1 1 1 1 1 1
symmnumber: 1
zpe: 667321.1 jmol-1
zpe.correction: 0.254169 hartree
zpe.thermalcorrener: 0.268600 hartree
zpe.thermalcorrenthalpy: 0.269544 hartree
zpe.thermalcorrgfe: 0.212019 hartree
zpe.sumelectzpe: -503.304775 hartree
zpe.sumelectthermal: -503.290345 hartree
zpe.sumelectthermalent: -503.289401 hartree
zpe.sumelectthermalfe: -503.346926 hartree
dipole: -0.2414 -0.5056 -1.9908
dipole: 2.0682
quadrupole: -61.6524 -67.0170 -76.5566
quadrupole: 3.1023 1.8446 -1.7683
quadrupole: 6.7562 1.3917 -8.1479 3.1023 1.8446 -1.7683
hfenergy: -503.5589446 hartree
pointgroup: C01 [X(C9H18O2)]
dipole: -0.0789669 -0.3142294 -0.746388 debye
polarizability: 113.9458617|3.7958666|102.3997456|1.0460618|-1.55574|95.7501582 unknown
InChI: InChI=1S/C9H18O2/c1-5-6-8(4)9(10)11-7(2)3/h7-8H,5-6H2,1-4H3
charge 0 multiplicity 1
29 atoms
O  -0.985247 0.158239 -0.411886
O  -0.635167 0.912139 1.767962
C  1.101388 1.289734 0.037197
C  1.953692 0.131151 -0.551193
C  2.297325 -0.978987 0.467674
C  0.862221 2.404211 -1.015493
C  -0.232094 0.784093 0.586685
C  -2.33332 -0.391818 -0.016832
C  3.204852 -2.072798 -0.134712
C  -3.159578 -0.398451 -1.304757
C  -2.137165 -1.780233 0.608695
H  1.630273 1.719816 0.909053
H  1.414309 -0.30681 -1.413379
H  2.89399 0.568452 -0.94533
H  1.361108 -1.441626 0.83979
H  2.792612 -0.527951 1.351262
H  1.830968 2.809234 -1.360797
H  0.319782 2.001153 -1.888313
H  0.273094 3.238888 -0.594643
H  -2.7573 0.301978 0.733209
H  2.721477 -2.553831 -1.006069
H  4.166734 -1.647084 -0.478284
H  3.430326 -2.862247 0.605468
H  -4.179229 -0.770511 -1.096401
H  -3.238011 0.618372 -1.726156
H  -2.696741 -1.055458 -2.062178
H  -3.117525 -2.213534 0.880118
H  -1.52666 -1.712352 1.524811
H  -1.642214 -2.461372 -0.106502
