program: Gaussian 09
title: 000226891
version: EM64L-G09RevD.01
frameworkgroup: C1[X(C14H11ClN2O3S)]
method: RPBEPBE
basis: SDD
operation: Freq
keyword: #p
keyword: freq=noraman
keyword: PBEPBE/SDD
title: #p freq=noraman PBEPBE/SDD
converged: YES YES NO NO
title: Mulliken charges:
elementType: Cl S O O O N N C C C C C C C C C C C C C C H H H H H H H H H H H
charge: -0.067096 0.269524 -0.241058 -0.217199 -0.217123 -0.439749 0.022069 -0.282605 0.493115 -0.224091 -0.181191 -0.202577 -0.430713 -0.330327 -0.101043 -0.199268 0.379255 -0.371485 -0.343306 0.254879 -0.668971 0.264326 0.263320 0.237093 0.313061 0.262917 0.251604 0.325544 0.287480 0.289124 0.302196 0.302296
chargesum: 0.00000
title: Mulliken charges with hydrogens summed into heavy atoms:
elementType: Cl S O O O N N C C C C C C C C C C C C C C
charge: -0.067096 0.269524 -0.241058 -0.217199 -0.217123 -0.114205 0.022069 -0.282605 0.493115 -0.224091 0.083134 0.060743 -0.193620 -0.017266 0.161874 0.052335 0.379255 -0.084005 -0.054182 0.254879 -0.064479
polarizability: 3.58853370e+02 -2.74418204e+00 1.90524576e+02 5.61286023e+00 2.06541242e+00 1.46064326e+02
1716.lowfreq: 0.0008 0.0009 0.0022 0.5986 4.5660 6.9961 12.6298 19.6617 27.4165
frequency: 12.3644 19.6326 27.3976 48.2320 73.0942 74.1092 78.5313 87.1163 98.0086 144.8842 163.3489 194.9516 249.3920 264.4283 277.6248 304.8672 331.8923 369.3415 392.4987 409.8251 411.9573 424.4085 470.1399 496.7252 508.9923 524.2648 540.0073 572.1435 621.9531 626.2866 662.5256 684.9913 686.9321 692.1256 722.7689 723.7840 738.5918 787.7883 836.5178 839.4020 843.7936 850.8434 867.2696 906.9586 941.6655 958.2636 983.5850 991.5639 994.1158 996.1861 998.5319 1060.5891 1083.1736 1095.9730 1111.2629 1118.2215 1152.7279 1179.6813 1189.2371 1210.4810 1223.5774 1258.3870 1270.0717 1289.8220 1298.7363 1351.6008 1367.1685 1391.3350 1403.5837 1416.8436 1419.8545 1458.9478 1481.8789 1522.5721 1584.0267 1589.8870 1592.0159 1603.4940 1614.2399 3070.7758 3127.5085 3147.2110 3152.8100 3157.1423 3159.8147 3164.9493 3182.6905 3185.3602 3194.3527 3451.0982
redmass: 7.1833 10.9941 6.1000 4.9817 7.0755 6.2889 7.8565 3.2402 12.5004 9.3916 6.9523 8.3122 7.8948 7.5771 8.3480 6.7910 8.0847 7.3109 8.0817 2.9394 2.9777 8.1553 3.3562 7.3615 5.9400 4.3312 4.8239 2.9968 7.1838 7.1773 5.0919 6.5123 8.6923 6.6640 3.1464 4.5150 1.2298 9.3710 1.3624 1.3150 5.5213 1.5221 1.4127 1.7270 6.5327 1.3621 1.3313 1.3584 1.4803 3.1590 3.6106 3.5924 3.0093 2.9285 1.2916 1.3666 1.1109 1.4035 1.1231 3.9846 4.8096 1.2104 1.9085 1.2594 1.3889 6.5395 4.9925 8.2613 3.9328 4.7209 1.0989 2.1727 2.3981 2.5374 8.0213 5.0774 5.7019 4.9593 6.7298 1.0565 1.0900 1.0904 1.1093 1.0914 1.0889 1.0956 1.0952 1.0959 1.0954 1.0765
irintensity: 0.5868 0.4725 0.1441 1.4540 0.4784 0.5542 1.1938 15.3144 1.1168 5.4763 1.7246 2.2574 2.4664 1.0443 7.3881 2.4255 0.2201 11.9325 0.7250 0.0631 0.1204 3.5894 11.0514 29.9330 8.7324 4.0870 22.1092 6.8480 2.0631 0.4649 17.7540 91.0600 0.2226 7.6977 4.0875 9.0816 37.4854 35.4108 35.4043 19.1009 1.8604 46.3803 52.8927 11.8969 0.3720 1.7262 4.2130 2.7086 9.6907 33.7757 0.7383 73.9520 11.4341 7.6700 10.8806 15.4161 0.3662 125.0374 26.6239 11.7787 504.2362 18.6922 20.2904 1.0990 11.1546 56.8082 106.9355 55.4911 30.9038 23.2365 21.6422 37.8623 49.4447 591.6825 0.7143 255.7921 117.6773 100.0403 98.2389 2.6988 12.7382 3.7746 0.3420 2.7845 0.9656 1.9960 0.0360 2.3274 5.7949 101.0208
temp: 298.150 k
press: 1.00000 atm
elementType: 17 16 8 8 8 7 7 6 6 6 6 6 6 6 6 6 6 6 6 6 6 1 1 1 1 1 1 1 1 1 1 1
symmnumber: 1
zpe: 591312.5 jmol-1
zpe.correction: 0.225219 hartree
zpe.thermalcorrener: 0.244455 hartree
zpe.thermalcorrenthalpy: 0.245399 hartree
zpe.thermalcorrgfe: 0.172853 hartree
zpe.sumelectzpe: -1731.833128 hartree
zpe.sumelectthermal: -1731.813892 hartree
zpe.sumelectthermalent: -1731.812948 hartree
zpe.sumelectthermalfe: -1731.885494 hartree
dipole: 6.1380 -2.6667 -1.8048
dipole: 6.9313
quadrupole: -163.0121 -145.0615 -136.5026
quadrupole: 25.9404 -2.2728 0.8338
quadrupole: -14.8200 3.1306 11.6894 25.9404 -2.2728 0.8338
hfenergy: -1732.058347 hartree
pointgroup: C01 [X(C14H11Cl1N2O3S1)]
dipole: -2.4111908 1.2308809 -0.3280767 debye
polarizability: 358.7095953|0.8213728|183.0605305|8.1317391|16.7970823|153.6721458 unknown
InChI: InChI=1S/C14H11ClN2O3S/c15-9-14(18)16-10-1-5-12(6-2-10)21-13-7-3-11(4-8-13)17(19)20/h1-8,16H,9H2
charge 0 multiplicity 1
32 atoms
Cl -6.650868 -0.662176 -2.335826
S  1.05432 2.5062 0.95433
O  -5.015697 -1.097564 1.372228
O  5.085143 -2.65235 -1.009338
O  6.648741 -1.136854 -0.321607
N  -4.282647 0.006132 -0.581969
N  5.423652 -1.502765 -0.521026
C  -0.532718 1.692159 0.49031
C  -3.033493 0.550964 -0.176466
C  2.307672 1.250836 0.487673
C  -1.060183 1.865663 -0.810686
C  -1.258849 0.957941 1.454682
C  -2.303361 1.295347 -1.143059
C  -2.50629 0.382771 1.132889
C  1.980692 -0.021081 -0.044465
C  3.667599 1.612254 0.69029
C  4.350095 -0.553181 -0.171431
C  3.003406 -0.927973 -0.376543
C  4.693804 0.711192 0.361557
C  -5.166311 -0.747838 0.163236
C  -6.452007 -1.211288 -0.530512
H  -0.503049 2.442961 -1.554754
H  -0.850154 0.833922 2.462463
H  -2.7086 1.432481 -2.152961
H  -3.069612 -0.185881 1.874735
H  0.934897 -0.302685 -0.196912
H  3.919401 2.59514 1.102406
H  -4.575991 0.191546 -1.549293
H  2.778438 -1.915552 -0.787884
H  5.746794 0.965504 0.507129
H  -7.323521 -0.810026 0.006816
H  -6.487003 -2.3104 -0.542211
