program: Gaussian 09
title: 000226890
version: EM64L-G09RevD.01
frameworkgroup: C1[X(C12H19NO2)]
method: RPBEPBE
basis: SDD
operation: Freq
keyword: #p
keyword: freq=noraman
keyword: PBEPBE/SDD
title: #p freq=noraman PBEPBE/SDD
converged: YES YES NO NO
title: Mulliken charges:
elementType: O O N C C C C C C C C C C C C H H H H H H H H H H H H H H H H H H H
charge: -0.445010 -0.268646 -0.130403 -0.459213 -0.324152 -0.309677 0.329538 -0.683866 -0.675176 0.085324 -0.490083 0.329538 -0.380872 -0.354900 -0.537881 0.226093 0.231114 0.185918 0.229314 0.183744 0.200304 0.230569 0.205360 0.207938 0.228343 0.210847 0.204544 0.294533 0.211184 0.238843 0.352565 0.215575 0.242308 0.216384
chargesum: 0.00000
title: Mulliken charges with hydrogens summed into heavy atoms:
elementType: O O N C C C C C C C C C C C C
charge: -0.092445 -0.268646 -0.130403 -0.002007 0.091079 0.074371 0.329538 -0.039999 -0.031442 0.085324 -0.195550 0.329538 -0.169688 -0.116057 0.136387
polarizability: 1.79116567e+02 -7.34473884e+00 1.58230828e+02 -2.87509466e+00 -5.98125478e+00 1.03319509e+02
1716.lowfreq: -8.8169 -0.0009 -0.0007 -0.0001 2.5525 6.3452 28.4229 42.7045 55.8618
frequency: 28.3627 42.6592 55.8543 82.2578 83.1716 111.9760 132.2875 185.9031 197.6825 206.1747 229.1443 240.0331 246.1576 290.4736 303.6191 331.7832 333.0828 367.9342 388.6035 427.2864 440.0536 456.4022 494.6929 546.8988 573.5699 591.8718 689.6315 713.3325 752.3989 780.1014 781.4058 797.9220 801.0868 885.5571 894.9103 904.7424 932.8979 989.0842 998.3757 1006.3656 1058.9979 1074.8009 1083.9101 1087.6645 1112.5105 1113.7917 1135.4973 1149.0969 1163.6290 1175.0723 1203.8232 1212.7015 1249.7169 1259.0067 1265.4412 1287.6915 1293.2650 1356.1371 1363.2094 1373.4699 1387.4069 1388.2929 1397.6053 1428.5744 1440.7837 1459.4684 1464.7033 1465.7703 1469.6993 1473.4954 1476.0193 1478.9761 1485.1790 1490.1720 1491.1081 1600.2921 1627.0170 2846.3780 2857.2327 2891.9500 2949.5220 2982.0942 2982.4051 3014.5213 3030.2930 3032.8802 3037.1867 3073.4349 3075.3386 3088.2702 3091.3294 3110.4966 3119.3297 3161.9936 3165.1574 3583.4906
redmass: 3.5669 3.2593 2.9442 2.7948 2.0975 2.1621 3.9838 2.4265 1.5780 2.3786 2.4737 1.5658 1.3536 1.8466 2.2945 1.4985 1.6848 5.7829 5.4518 2.9685 3.1289 2.9356 3.8834 3.6673 3.3071 4.6569 5.9769 3.7889 2.6298 1.6728 2.7161 1.1680 1.3683 1.3691 2.1275 3.5783 1.4208 2.3381 1.8136 3.2148 2.7314 1.9788 2.3457 1.9771 1.2635 1.8798 1.7045 1.3034 1.7838 1.3875 2.2083 1.9411 2.0495 2.0727 1.3541 1.2287 1.3048 1.4510 1.3784 1.4256 1.2392 1.2400 5.6760 1.9048 1.4483 1.1331 1.0534 1.0506 1.0558 1.0706 1.0911 1.0642 1.0614 2.3919 1.1332 6.8024 7.2988 1.0723 1.0715 1.0705 1.0335 1.0359 1.0359 1.0859 1.0879 1.1035 1.0871 1.0986 1.0977 1.1003 1.1003 1.0895 1.0985 1.0912 1.0933 1.0659
irintensity: 0.0372 2.1941 0.4075 5.1207 0.8005 1.5238 2.8551 1.4973 0.7593 1.7944 0.4435 0.9830 0.3656 2.8380 1.1916 79.7240 57.6206 0.3047 0.9942 1.7615 10.3436 6.8223 6.0595 7.1246 7.6906 5.5762 34.9473 0.2778 5.9048 47.4531 16.0985 8.2238 6.6044 1.2058 2.7319 3.4031 14.1075 15.7176 15.5746 68.1902 46.7022 20.3726 12.9257 35.5854 0.2519 15.2229 135.0336 85.5903 11.0756 12.4783 30.6451 6.9756 37.0482 57.9373 70.5660 18.8580 25.5659 18.4924 1.8702 1.5038 24.9173 21.8203 24.2185 49.4672 4.3362 22.5911 4.8655 12.0902 4.3812 51.8473 5.7618 8.8737 9.8715 121.7250 7.1441 13.1962 18.0306 45.0475 165.3879 64.3638 76.9265 38.9489 23.3064 14.4298 10.4142 55.8014 16.0745 29.6671 93.2552 46.4527 36.2887 26.2626 22.2107 2.6256 15.4220 25.3180
temp: 298.150 k
press: 1.00000 atm
elementType: 8 8 7 6 6 6 6 6 6 6 6 6 6 6 6 1 1 1 1 1 1 1 1 1 1 1 1 1 1 1 1 1 1 1
symmnumber: 1
zpe: 756357.2 jmol-1
zpe.correction: 0.288081 hartree
zpe.thermalcorrener: 0.304867 hartree
zpe.thermalcorrenthalpy: 0.305812 hartree
zpe.thermalcorrgfe: 0.243162 hartree
zpe.sumelectzpe: -672.664475 hartree
zpe.sumelectthermal: -672.647689 hartree
zpe.sumelectthermalent: -672.646745 hartree
zpe.sumelectthermalfe: -672.709395 hartree
dipole: 1.9876 1.2077 -0.7659
dipole: 2.4486
quadrupole: -72.1688 -85.1614 -93.5077
quadrupole: 2.5553 -0.7720 -1.1750
quadrupole: 11.4439 -1.5488 -9.8951 2.5553 -0.7720 -1.1750
hfenergy: -672.9525563 hartree
pointgroup: C01[X(C12H19N1O2)]
dipole: 0.7717593 -0.5146553 0.2599583 debye
polarizability: 179.4367115|6.6374939|158.5337558|3.1783398|-1.6239355|102.6964369 unknown
InChI: InChI=1S/C12H19NO2/c1-4-13(5-2)9-10-8-11(15-3)6-7-12(10)14/h6-8,14H,4-5,9H2,1-3H3
charge 0 multiplicity 1
34 atoms
O  0.226314 -3.23089 0.204208
O  2.520569 1.896833 -0.251278
N  -2.229008 0.244847 0.122415
C  -1.479679 -1.010464 -0.128654
C  -2.266511 0.576696 1.574847
C  -3.574443 0.239268 -0.511137
C  0.033775 -0.836291 -0.055628
C  -2.532126 2.06851 1.851309
C  -3.522737 0.457267 -2.03568
C  0.87325 -1.973903 0.106493
C  0.640432 0.427614 -0.173152
C  2.048432 0.574031 -0.124703
C  2.274563 -1.837251 0.155818
C  2.87569 -0.560677 0.041995
C  3.968216 2.09339 -0.213434
H  -1.73797 -1.378028 -1.140027
H  -1.78126 -1.827562 0.569979
H  -3.021155 -0.052092 2.113397
H  -1.278873 0.312825 1.995353
H  -4.129199 -0.707102 -0.282362
H  -4.161122 1.060194 -0.06118
H  -1.758533 2.688806 1.365536
H  -3.517921 2.395772 1.474338
H  -2.509551 2.266243 2.939301
H  -3.029693 1.417841 -2.265241
H  -2.961027 -0.343166 -2.550575
H  -4.545005 0.471927 -2.458301
H  -0.000355 1.304803 -0.303384
H  2.911074 -2.723309 0.282052
H  3.965196 -0.475721 0.084599
H  0.890608 -3.950066 0.344048
H  4.397923 1.762234 0.753321
H  4.116682 3.177169 -0.330914
H  4.472842 1.557252 -1.042058
