program: Gaussian 09
title: 000226883
version: EM64L-G09RevD.01
frameworkgroup: C1[X(C5H5ClN2OS)]
method: RPBEPBE
basis: SDD
operation: Freq
keyword: #p
keyword: freq=noraman
keyword: PBEPBE/SDD
title: #p freq=noraman PBEPBE/SDD
converged: YES YES NO NO
title: Mulliken charges:
elementType: Cl S O N N C C C C C H H H H H
charge: -0.072009 0.236144 -0.176217 -0.333228 0.027139 -0.124527 0.264522 -0.667291 -0.476117 -0.158671 0.337573 0.301943 0.302049 0.273521 0.265171
chargesum: 0.00000
title: Mulliken charges with hydrogens summed into heavy atoms:
elementType: Cl S O N N C C C C C
charge: -0.072009 0.236144 -0.176217 0.004345 0.027139 -0.124527 0.264522 -0.063300 -0.202597 0.106500
polarizability: 1.42926905e+02 -5.45328002e+00 1.10894669e+02 -2.14602339e-01 -5.13903689e-01 3.99816530e+01
1716.lowfreq: -8.3876 -5.9882 -0.0020 -0.0006 0.0020 3.7931 5.4618 59.2656 88.2717
frequency: 3.4437 59.2555 88.2682 94.5433 192.0726 270.5337 275.4765 375.9977 465.8967 494.7556 543.6565 558.4527 599.1553 670.0957 682.0191 699.0806 725.1491 799.9508 834.1064 867.3484 897.2896 900.4768 1037.4140 1091.6750 1151.0935 1189.9682 1241.6259 1259.3750 1278.9413 1416.8689 1461.3174 1511.3264 1566.3235 1633.0572 3071.0099 3153.9864 3205.7572 3255.3362 3450.1529
redmass: 10.7207 3.9971 3.4643 12.2943 11.1577 6.8713 8.3778 13.1911 7.2701 4.1871 12.0891 3.2921 5.1959 7.7641 6.9803 1.1757 1.2441 7.0103 6.2337 1.3244 6.6010 1.7295 1.9888 1.7969 1.1070 4.3761 2.3870 1.1865 1.7237 1.0863 5.1290 1.8606 6.9711 7.4168 1.0564 1.1095 1.0921 1.1013 1.0773
irintensity: 0.0877 11.1060 5.2863 1.2717 8.2615 2.8131 2.5736 4.0994 42.1960 1.9577 9.2554 3.3854 13.0101 53.5722 21.4587 156.1844 10.3768 12.8001 2.2962 3.0599 9.4121 13.5084 36.5323 39.1083 0.6812 51.0401 32.0599 18.1223 4.2118 30.9260 6.3180 694.2608 122.9853 185.5443 2.7173 0.3848 5.6535 1.2898 123.7999
temp: 298.150 k
press: 1.00000 atm
elementType: 17 16 8 7 7 6 6 6 6 6 1 1 1 1 1
symmnumber: 1
zpe: 257629.3 jmol-1
zpe.correction: 0.098126 hartree
zpe.thermalcorrener: 0.107984 hartree
zpe.thermalcorrenthalpy: 0.108928 hartree
zpe.thermalcorrgfe: 0.058478 hartree
zpe.sumelectzpe: -1235.630349 hartree
zpe.sumelectthermal: -1235.620491 hartree
zpe.sumelectthermalent: -1235.619547 hartree
zpe.sumelectthermalfe: -1235.669997 hartree
dipole: 0.4663 -2.3723 -0.0252
dipole: 2.4178
quadrupole: -57.7909 -81.4933 -73.2872
quadrupole: -3.6460 -0.0525 -0.1781
quadrupole: 13.0662 -10.6362 -2.4301 -3.6460 -0.0525 -0.1781
hfenergy: -1235.7284747 hartree
pointgroup: C01 [X(C5H5Cl1N2O1S1)]
dipole: 0.292464 -0.7791167 0.4607516 debye
dipolederiv: -0.3690101 -0.0880231 0.0032248 -0.322365 -0.5404702 0.1331675 0.1236537 0.1797622 -0.2201877 -0.1924777 -0.0149279 -0.0555887 0.237366 -0.318066 0.3004445 -0.202305 0.2502237 -0.0622004 -0.6205618 -0.15327 0.015625 0.5188806 -0.7611462 0.3195288 -0.3204206 0.1916076 -0.4647377 -1.9579697 0.1275484 -0.3813548 0.2622989 -0.474241 0.1477549 -0.4459009 0.1188911 -0.438159 -0.4303662 -0.1397306 0.0223046 -0.2142944 -0.6049584 0.2172299 0.0630337 0.2304142 -0.2801022 1.4430005 -0.0795241 0.3251014 0.0554789 0.6197801 -0.3442257 0.2645517 -0.3632119 0.2973944 1.5715162 0.0779438 0.214355 -1.0496061 0.8416621 -0.5024964 0.7916892 -0.2892114 0.5103415 -0.0241525 0.0015009 -0.0326396 0.3181366 0.6625925 -0.2024965 -0.1975362 -0.2655212 0.238551 -0.1532487 0.1772962 -0.0664309 0.0416957 0.0708522 -0.2196316 0.0127238 -0.1951297 -0.2196928 0.1632383 0.0802292 0.0083944 0.1465173 0.088558 -0.06995 -0.0399877 -0.0796117 -0.0439728 0.3711412 0.0917075 -0.0349586 0.1516582 0.2385336 0.0656483 -0.0740707 0.0540798 0.2646828 0.074322 -0.0391503 -0.0206509 -0.0529028 0.0149458 0.0398595 -0.0515128 0.0169813 -0.0124619 0.0366794 0.0031165 0.0465959 0.0284764 -0.0271227 -0.0026086 0.0725513 0.0190504 0.0693902 0.0262907 -0.0116014 -0.0360401 -0.0191114 0.1343959 0.0564648 -0.0281311 0.0564657 0.2011836 0.0615985 -0.033115 -0.0079374 -0.1022288 0.0546843 0.0613106 0.0316616 0.0752099 0.1599709 unknown
polarizability: 140.8011669|6.9533748|94.5898083|15.8925269|-28.2694344|58.4122511 unknown
InChI: InChI=1S/C5H5ClN2OS/c6-3-4(9)8-5-7-1-2-10-5/h1-2,8H,3H2
charge 0 multiplicity 1
15 atoms
Cl -3.03893 -2.151217 0.322301
S  2.002167 -1.383675 0.974595
O  -1.426843 1.309677 -1.113429
N  -0.497004 -0.569616 -0.005152
N  1.441156 0.845563 -0.425524
C  0.854296 -0.222531 0.070176
C  -1.529001 0.18043 -0.571237
C  -2.9276 -0.449951 -0.520631
C  3.310454 -0.219101 0.567687
C  2.814729 0.85459 -0.149625
H  -0.781984 -1.470892 0.398207
H  -3.30006 -0.596892 -1.54491
H  -3.605583 0.209077 0.04076
H  4.33137 -0.416417 0.885294
H  3.412731 1.691655 -0.510513
