program: Gaussian 09
title: 000226841
version: EM64L-G09RevD.01
frameworkgroup: C1[X(C7H18N2O)]
method: RPBEPBE
basis: SDD
operation: Freq
keyword: #p
keyword: freq=noraman
keyword: PBEPBE/SDD
title: #p freq=noraman PBEPBE/SDD
converged: YES YES NO NO
title: Mulliken charges:
elementType: O N N C C C C C C C H H H H H H H H H H H H H H H H H H
charge: -0.439614 -0.311810 -0.576342 0.261027 -0.398466 -0.383546 -0.730280 -0.712777 -0.065840 -0.712543 0.203017 0.180713 0.258470 0.162823 0.237357 0.204227 0.198450 0.245612 0.192325 0.225831 0.234144 0.233823 0.252286 0.256835 0.247136 0.197491 0.217528 0.322127
chargesum: 0.00000
title: Mulliken charges with hydrogens summed into heavy atoms:
elementType: O N N C C C C C C C
charge: -0.117487 -0.053340 -0.067221 0.261027 -0.014737 0.016634 -0.081991 -0.060478 0.167982 -0.050389
polarizability: 1.13710093e+02 -6.28817758e-01 8.90844670e+01 4.18409596e-01 2.27753918e-01 8.65356943e+01
1716.lowfreq: -5.3708 -0.0007 -0.0003 0.0006 8.3352 14.0674 35.7916 42.2581 75.2444
frequency: 35.5785 41.7895 75.1951 123.6341 179.0833 211.5991 224.1086 233.0802 255.0119 263.2604 277.3853 305.1437 329.8961 336.2526 386.4437 404.4090 431.1313 437.8037 470.4989 534.4397 619.6492 683.7114 747.9689 818.4252 896.5396 907.4554 911.7935 932.0868 942.1018 982.2190 988.5813 1016.2088 1023.4718 1058.8540 1123.6230 1138.2841 1155.6189 1186.5487 1202.3581 1232.4195 1239.5905 1271.9927 1318.0909 1333.3872 1338.2561 1364.5934 1369.0033 1370.4787 1380.8742 1391.1466 1448.4263 1459.0257 1462.1726 1466.8241 1468.1728 1474.5693 1482.7268 1485.2403 1488.4346 1632.0980 2815.7280 2836.3928 2966.7082 2968.7457 2977.2709 3000.4782 3035.1195 3052.9505 3061.6116 3071.3393 3077.9480 3089.7314 3092.8319 3104.9248 3420.8142 3451.4065 3539.1962 3551.4644
redmass: 3.0237 3.4589 3.4474 2.2532 2.1297 1.7164 1.4369 1.8742 1.1623 1.4001 1.1263 1.1413 2.3626 2.0103 2.3514 3.4129 2.1674 2.1539 2.3982 3.2327 1.5159 1.2504 3.4508 2.8476 1.3913 2.0688 1.7797 1.7026 1.6672 1.3150 1.7841 2.5182 1.5056 1.5529 2.2509 2.1768 2.5027 1.2951 2.3734 1.4236 2.9321 1.4284 1.3240 1.3310 1.6914 1.2001 1.3418 1.3743 1.2432 1.2841 1.1683 1.0707 1.0562 1.0601 1.0652 1.0693 1.0578 1.0680 1.0661 1.0990 1.0709 1.0704 1.0386 1.0378 1.0389 1.0878 1.0858 1.0921 1.0970 1.0951 1.0926 1.0982 1.0989 1.1004 1.0441 1.0737 1.0657 1.0969
irintensity: 2.4646 0.2367 1.9154 0.4306 4.1714 0.7824 7.4511 0.9852 2.6179 4.3759 41.1990 106.2434 17.2746 21.5100 6.3393 19.4949 10.8161 9.2750 26.4408 1.0337 256.6801 78.8900 0.8314 8.6155 13.4320 4.1907 2.6770 9.4059 5.8150 1.7451 0.5700 22.5762 87.5466 9.6833 55.5489 49.4480 15.2036 14.7411 39.6469 7.7048 27.8605 15.0919 9.1136 2.1547 4.8450 33.3612 12.6336 38.9027 20.2131 23.5418 18.5948 14.9011 3.8968 4.5188 3.2701 4.9621 14.6363 10.0526 15.8082 38.7254 105.0584 151.4107 18.0476 48.0791 12.8306 34.7338 18.9787 10.2545 29.7067 48.5700 55.0770 33.2853 18.7666 30.2406 3.5756 0.5318 5.3159 0.2311
temp: 298.150 k
press: 1.00000 atm
elementType: 8 7 7 6 6 6 6 6 6 6 1 1 1 1 1 1 1 1 1 1 1 1 1 1 1 1 1 1
symmnumber: 1
zpe: 654856.3 jmol-1
zpe.correction: 0.249422 hartree
zpe.thermalcorrener: 0.262947 hartree
zpe.thermalcorrenthalpy: 0.263891 hartree
zpe.thermalcorrgfe: 0.209729 hartree
zpe.sumelectzpe: -461.382754 hartree
zpe.sumelectthermal: -461.369229 hartree
zpe.sumelectthermalent: -461.368285 hartree
zpe.sumelectthermalfe: -461.422447 hartree
dipole: 0.1872 0.3782 -2.6692
dipole: 2.7023
quadrupole: -76.9631 -62.1674 -62.1534
quadrupole: -7.2084 4.4802 1.6126
quadrupole: -9.8684 4.9272 4.9412 -7.2084 4.4802 1.6126
hfenergy: -461.6321761 hartree
pointgroup: C01 [X(C7H18N2O1)]
dipole: -0.0542645 0.121704 1.0547965 debye
polarizability: 113.7002967|0.8834238|89.1106783|-0.0982647|-0.1764806|86.5192798 unknown
InChI: InChI=1S/C7H18N2O/c1-6(10)4-9-5-7(2,3)8/h6,9-10H,4-5,8H2,1-3H3
charge 0 multiplicity 1
28 atoms
O  3.915161 -0.819742 -0.261015
N  0.260432 0.071767 0.161998
N  -3.465863 -0.769135 0.524488
C  -2.286316 -0.009078 0.030049
C  -0.961732 -0.66177 0.556198
C  1.534465 -0.645193 0.366592
C  -2.414893 1.443008 0.549516
C  -2.310536 -0.032763 -1.513234
C  2.702925 0.018637 -0.397217
C  2.98397 1.466188 0.042728
H  -0.891588 -1.683999 0.132483
H  -1.061895 -0.779852 1.667324
H  0.28245 1.011351 0.578867
H  1.825224 -0.739922 1.448136
H  1.421967 -1.67374 -0.023003
H  -1.628378 2.09364 0.125677
H  -2.345921 1.48248 1.655046
H  -3.397041 1.849924 0.254461
H  -2.343867 -1.074684 -1.888067
H  -3.202136 0.496613 -1.891334
H  -1.396715 0.43946 -1.911421
H  2.483728 -0.011138 -1.477353
H  -3.539324 -0.793189 1.549294
H  -3.542741 -1.709806 0.119191
H  3.881145 1.847883 -0.474453
H  3.161406 1.524123 1.135728
H  2.138775 2.133272 -0.209065
H  4.182097 -0.828233 0.694685
