program: Gaussian 09
title: 000226837
version: EM64L-G09RevD.01
frameworkgroup: C1[X(C6H15NO2)]
method: RPBEPBE
basis: SDD
operation: Freq
keyword: #p
keyword: freq=noraman
keyword: PBEPBE/SDD
title: #p freq=noraman PBEPBE/SDD
converged: NO YES NO NO
title: Mulliken charges:
elementType: O O N C C C C C C H H H H H H H H H H H H H H H
charge: -0.436435 -0.444004 -0.198895 0.282669 -0.399783 -0.329297 -0.777051 -0.642071 -0.634723 0.194853 0.232001 0.174206 0.222356 0.219340 0.219025 0.257227 0.251260 0.208459 0.228233 0.223347 0.197669 0.254172 0.340933 0.356507
chargesum: 0.00000
title: Mulliken charges with hydrogens summed into heavy atoms:
elementType: O O N C C C C C C
charge: -0.095501 -0.087497 -0.198895 0.282669 0.027072 0.067266 -0.081459 0.045880 0.040465
polarizability: 8.46751331e+01 -3.75444019e+00 7.65808866e+01 -2.11304381e+00 -3.74681744e-01 7.57504153e+01
1716.lowfreq: -20.1747 -11.1597 0.0005 0.0006 0.0007 17.2112 77.7881 88.6931 106.7902
frequency: 77.6759 88.6847 106.7125 171.6323 188.8572 217.3036 241.8964 266.6448 297.5924 328.7043 334.6854 345.8541 391.8977 409.5869 457.5468 492.3394 563.3025 670.2689 686.0844 828.7902 881.8218 940.0096 956.6329 976.4709 983.4621 1001.2907 1038.6890 1083.9752 1103.5109 1116.7389 1143.7155 1158.6100 1187.2555 1213.9107 1256.2626 1271.4481 1301.4158 1326.6766 1372.4003 1381.9702 1392.8792 1421.6921 1443.6398 1458.0280 1462.3298 1472.1477 1479.9007 1486.9596 1490.7171 1500.1418 1504.7268 2893.9467 2913.2787 2937.5562 2946.2494 2983.8239 3030.1570 3031.7318 3069.7720 3072.3157 3079.4372 3091.4481 3092.3791 3103.4439 3256.7923 3573.1596
redmass: 2.9084 2.7404 3.6424 1.8452 2.1097 2.1139 1.0671 1.2338 3.8475 2.1508 1.4280 1.5795 2.5942 2.0352 2.6624 3.0537 3.2970 1.9416 1.4576 2.5774 1.8036 1.5799 1.9676 2.2015 3.8621 4.3676 1.4818 1.2498 1.4099 1.7612 1.4985 1.5248 2.1383 2.2162 2.1651 2.1784 1.5100 1.2821 1.1737 1.2414 1.2178 1.1298 1.1324 1.0741 1.0577 1.0576 1.0517 1.0510 1.0687 1.0500 1.0724 1.0545 1.0514 1.0714 1.0675 1.0363 1.0823 1.0794 1.0952 1.0964 1.0943 1.0988 1.0982 1.0966 1.0637 1.0660
irintensity: 3.5241 2.2576 6.6130 1.7734 7.3233 1.4700 0.3116 22.1946 18.1022 0.4007 51.0791 77.7696 20.8302 0.4580 17.7064 0.7169 3.0929 56.0272 60.6103 4.2506 15.8931 10.1004 48.2607 46.0040 29.4588 86.8435 13.2277 9.3163 16.2180 25.4888 2.5827 11.9325 28.4969 1.5499 14.3446 36.0216 21.4994 7.5492 16.3741 25.4362 53.0986 6.5461 12.7064 4.8692 8.4371 13.4074 19.7293 17.7724 2.0818 22.0196 4.1873 79.5429 80.2437 91.7088 78.9589 20.4810 40.4259 39.0110 6.0131 18.7357 62.2736 15.9362 24.7687 22.5698 91.7344 7.2387
temp: 298.150 k
press: 1.00000 atm
elementType: 8 8 7 6 6 6 6 6 6 1 1 1 1 1 1 1 1 1 1 1 1 1 1 1
symmnumber: 1
zpe: 550587.1 jmol-1
zpe.correction: 0.209708 hartree
zpe.thermalcorrener: 0.221202 hartree
zpe.thermalcorrenthalpy: 0.222146 hartree
zpe.thermalcorrgfe: 0.173629 hartree
zpe.sumelectzpe: -442.014206 hartree
zpe.sumelectthermal: -442.002712 hartree
zpe.sumelectthermalent: -442.001768 hartree
zpe.sumelectthermalfe: -442.050284 hartree
dipole: 1.1672 -3.8502 1.0507
dipole: 4.1581
quadrupole: -57.5560 -66.0350 -54.9531
quadrupole: -3.0359 -5.9466 -2.2499
quadrupole: 1.9587 -6.5203 4.5616 -3.0359 -5.9466 -2.2499
hfenergy: -442.2239138 hartree
pointgroup: C01 [X(C6H15N1O2)]
dipole: -0.342126 1.5392871 0.4356703 debye
dipolederiv: -0.9345177 -0.0374043 0.0317005 -0.0661656 -0.5118514 0.1253635 0.0130301 0.1263028 -0.1689148 -0.5932438 -0.1125169 0.0474261 -0.2024395 -0.6647253 0.0238406 0.028903 -0.0652565 -0.5389493 -0.5257476 0.0234101 0.0148405 0.0554286 -0.7316211 0.0136512 -0.0232528 0.0347789 -0.51585 0.3885193 -0.0696917 0.0458273 -0.1930912 0.2126388 -0.061681 0.0901673 -0.0932183 0.0911764 0.5999118 0.0082507 0.0078657 -0.0245445 0.2803695 -0.0034135 0.0282408 -0.011012 0.1893629 0.3762037 0.0699916 -0.0841675 0.1587499 0.2069193 -0.0562515 -0.0511377 -0.0202357 0.3993978 -0.0540236 -0.003366 -0.0381918 -0.0343692 0.025706 0.0418111 -0.0206951 0.066845 -0.1247699 0.1624948 0.0618049 0.0655903 0.0701003 0.2438728 -0.1157843 0.1427367 -0.1928246 0.3332237 0.1536719 -0.0038494 -0.1102737 -0.0281039 0.4401217 0.0816195 -0.1438412 0.1502362 0.2009655 -0.0360665 0.0412534 0.003368 0.0461113 -0.2027301 -0.0408279 0.0236987 -0.089778 0.0441245 0.0416657 0.0079346 -0.0337271 0.0047433 0.0778947 -0.0211876 -0.0514578 0.0200035 -0.1253072 0.0225689 -0.0446854 -0.0100441 -0.0496475 0.019354 0.0434411 0.0433344 0.0214745 -0.2644078 -0.0973326 0.0684315 -0.019121 0.078683 0.0384988 0.0228966 -0.08065 0.0635026 0.0557113 0.1002127 -0.00864 -0.0071926 -0.0158142 -0.129057 -0.1143064 -0.0166583 -0.073545 0.0171745 -0.121039 0.0937397 -0.0586448 0.1001105 0.0568153 0.0005505 0.0003361 -0.0214604 0.0936144 0.0172972 -0.0765297 0.1127582 -0.0638035 0.0633336 0.0636678 0.0583035 0.0423636 0.0436449 0.1158631 0.0427906 0.0874126 0.0341284 -0.0254593 -0.1089302 0.0318501 -0.0780901 -0.0107112 0.0424256 -0.1032171 0.0359884 -0.0436162 -0.15553 0.1747108 -0.0322263 0.0850618 -0.063572 -0.1915458 0.0263553 -0.0564108 0.0258259 0.0903498 0.0422562 0.0263003 0.016785 0.074122 -0.1836937 0.0687518 -0.0000092 0.0252466 0.0524285 -0.0215423 -0.0676025 0.0096628 0.1029446 0.019774 -0.1362586 0.0317503 -0.0336075 -0.2611403 -0.0549399 0.0512034 0.040177 0.0227497 0.1344685 -0.0216242 -0.0624264 -0.0032985 0.0527592 0.0444442 -0.0154306 0.0087585 -0.141337 0.3477709 0.0603177 -0.0269885 0.0856122 0.3212839 -0.0812455 -0.0662058 -0.0814109 0.0180449 0.2143622 0.0447515 0.0226695 0.0737611 0.4997683 0.0018569 0.0310539 0.0408794 0.267562 unknown
polarizability: 84.0823994|-4.3469693|77.1842272|2.0427661|0.2516294|75.7398084 unknown
InChI: InChI=1S/C6H15NO2/c1-6(4-8,5-9)7(2)3/h8-9H,4-5H2,1-3H3
charge 0 multiplicity 1
24 atoms
O  2.664001 0.506852 -0.529427
O  -0.77676 -2.272257 0.079615
N  -1.156624 0.391153 0.007278
C  0.288326 -0.045438 0.137335
C  1.251086 0.899119 -0.641308
C  0.344637 -1.497906 -0.444227
C  0.691059 -0.103856 1.630683
C  -1.632397 0.615454 -1.3835
C  -1.628933 1.46711 0.906754
H  1.10237 1.947495 -0.300235
H  1.049062 0.84946 -1.724254
H  0.326693 -1.469435 -1.555899
H  1.277931 -1.996867 -0.136945
H  0.748287 0.896092 2.097955
H  1.678369 -0.58995 1.729465
H  -0.025824 -0.725518 2.194556
H  -1.328576 -0.219019 -2.03625
H  -1.269002 1.566723 -1.835293
H  -2.737142 0.648274 -1.378583
H  -2.720341 1.579754 0.772167
H  -1.161808 2.460554 0.705764
H  -1.452148 1.204276 1.960914
H  2.971291 0.664641 0.398275
H  -1.488057 -1.571014 0.22246
