program: Gaussian 09
title: 000021395
version: EM64L-G09RevD.01
frameworkgroup: C1[X(C11H14N2O2)]
method: RPBEPBE
basis: SDD
operation: Freq
keyword: #p
keyword: freq=noraman
keyword: PBEPBE/SDD
title: #p freq=noraman PBEPBE/SDD
converged: YES YES NO NO
title: Mulliken charges:
elementType: O O N N C C C C C C C C C C C H H H H H H H H H H H H H H
charge: -0.174913 -0.174876 -0.001943 -0.001959 0.232248 -0.498010 -0.498041 0.114783 0.114867 -0.447446 -0.447411 -0.781901 -0.781946 -0.161707 -0.161720 0.266789 0.260968 0.266828 0.260951 0.263318 0.261284 0.263264 0.261382 0.265559 0.253705 0.263288 0.263367 0.253726 0.265543
chargesum: 0.00000
title: Mulliken charges with hydrogens summed into heavy atoms:
elementType: O O N N C C C C C C C C C C C
charge: -0.174913 -0.174876 -0.001943 -0.001959 0.232248 0.029747 0.029738 0.114783 0.114867 0.077156 0.077235 0.000651 0.000691 -0.161707 -0.161720
polarizability: 1.44444231e+02 -1.06593401e-02 1.23156741e+02 -1.07086000e+01 9.23526741e-03 1.15365726e+02
1716.lowfreq: -16.3078 -10.0099 -0.0006 -0.0001 0.0004 6.2928 30.9926 37.4771 45.4358
frequency: 30.9722 37.3919 45.3348 59.6951 81.2068 93.2090 94.3424 102.6727 143.0302 151.4858 157.5726 183.9045 234.0773 256.5549 281.1531 317.2461 333.0647 370.5846 373.5468 398.9561 424.0336 479.0902 498.5460 516.8068 572.3586 595.0448 604.9573 701.8617 724.7953 765.2049 820.8330 894.5838 938.9496 939.0338 948.1413 969.5962 987.4672 1028.4063 1034.7625 1038.7268 1058.6472 1090.5104 1140.5869 1144.2851 1167.7454 1213.4475 1232.0271 1273.4680 1275.9490 1285.1980 1301.4706 1342.1630 1349.5456 1379.3039 1381.1220 1441.8450 1443.0867 1448.7474 1451.9190 1456.0949 1459.5791 1479.6179 1480.6592 1605.2561 1626.8580 2202.4254 2202.5544 2984.8226 2985.0171 2988.6990 2988.9531 3026.8542 3028.3779 3040.3321 3041.6360 3069.5302 3070.2992 3083.4881 3085.8093 3121.1087 3121.2987
redmass: 7.5551 6.7719 4.1060 6.3705 6.0959 2.4947 2.4233 5.9286 2.9459 1.2132 1.0997 5.1451 4.4776 3.3445 3.3061 3.7948 3.0801 3.5403 3.7657 4.0943 3.7138 5.1716 4.8924 4.3335 2.9832 2.8264 4.2569 2.5711 1.3747 1.4847 2.5864 3.2002 4.0889 3.6696 2.2203 1.9907 1.6180 2.5889 2.0215 2.5436 2.9584 2.2786 3.1075 2.1699 1.7747 1.6904 1.7628 1.2398 1.3202 1.1476 1.2202 1.3986 1.4344 1.2178 1.2148 1.0692 1.0656 1.0873 1.0734 1.0598 1.0599 1.0785 1.0798 8.7073 9.1568 12.4373 12.4427 1.0390 1.0390 1.0595 1.0597 1.0658 1.0623 1.0969 1.0991 1.0941 1.0938 1.1006 1.1010 1.1008 1.1009
irintensity: 1.4905 9.8834 6.8171 4.6611 0.5392 3.7802 0.6321 2.5437 0.1808 0.0203 0.7834 4.3601 5.6682 8.6090 2.5632 0.7480 0.6832 0.2775 0.2680 4.1663 3.1150 0.5279 7.3722 6.4064 13.9885 8.8706 0.5519 1.2431 23.7786 7.0659 16.7482 0.7360 1.5410 2.8864 38.2341 2.3120 4.8555 2.1580 1.1064 3.4666 0.2010 2.2685 117.8254 26.0594 57.9712 20.1538 23.7210 7.6165 1.6125 0.9399 0.1340 8.6095 0.5598 90.7352 31.9531 8.1764 52.9836 2.9429 4.4189 34.9955 14.5922 11.6520 0.6098 228.1275 0.7522 14.2546 6.0053 1.3847 0.4379 0.1901 8.6795 0.1051 11.3321 3.9563 1.8377 2.8611 10.5384 19.3345 18.3827 5.8378 7.0636
temp: 298.150 k
press: 1.00000 atm
elementType: 8 8 7 7 6 6 6 6 6 6 6 6 6 6 6 1 1 1 1 1 1 1 1 1 1 1 1 1 1
symmnumber: 1
zpe: 596933.8 jmol-1
zpe.correction: 0.227360 hartree
zpe.thermalcorrener: 0.244781 hartree
zpe.thermalcorrenthalpy: 0.245725 hartree
zpe.thermalcorrgfe: 0.180409 hartree
zpe.sumelectzpe: -686.348332 hartree
zpe.sumelectthermal: -686.330911 hartree
zpe.sumelectthermalent: -686.329967 hartree
zpe.sumelectthermalfe: -686.395283 hartree
dipole: -0.0027 -4.3584 -0.0009
dipole: 4.3585
quadrupole: -115.8667 -97.8617 -102.6516
quadrupole: 0.0032 13.1157 -0.0047
quadrupole: -10.4067 7.5983 2.8084 0.0032 13.1157 -0.0047
hfenergy: -686.5756925 hartree
pointgroup: C01 [X(C11H14N2O2)]
dipole: 0.002643 -1.7147443 0.0009141 debye
polarizability: 144.9341541|0.0278121|123.1567671|-10.0093272|-0.0208375|114.8757765 unknown
InChI: InChI=1S/C11H14N2O2/c1-9(14)11(10(2)15,5-3-7-12)6-4-8-13/h3-6H2,1-2H3
charge 0 multiplicity 1
29 atoms
O  -0.036574 -1.640638 2.26132
O  0.038694 -1.640544 -2.261143
N  3.866894 2.489839 -0.507936
N  -3.871239 2.483114 0.506823
C  0.000637 -0.669538 0.000114
C  1.173454 0.187334 -0.563655
C  -1.174113 0.185126 0.563281
C  0.533122 -1.605897 1.140496
C  -0.529603 -1.608055 -1.139542
C  1.768572 1.174271 0.479534
C  -1.770296 1.171274 -0.480047
C  1.752341 -2.465672 0.840712
C  -1.745553 -2.471994 -0.838415
C  2.928087 1.904981 -0.060806
C  -2.9312 1.900109 0.059861
H  1.967541 -0.478581 -0.940386
H  0.825892 0.742364 -1.452669
H  -1.967271 -0.482298 0.939313
H  -0.828165 0.740571 1.452653
H  1.013352 1.915367 0.802563
H  2.090764 0.638123 1.393932
H  -1.016117 1.913626 -0.802627
H  -2.091245 0.634788 -1.394679
H  1.796335 -3.300862 1.557087
H  2.678478 -1.870214 0.960506
H  1.747216 -2.849988 -0.194308
H  -1.738106 -2.856057 0.196682
H  -2.673858 -1.87977 -0.95749
H  -1.78734 -3.307482 -1.554573
