program: Gaussian 09
title: 000226828
version: EM64L-G09RevD.01
frameworkgroup: C1[X(C7H15NO3)]
method: RPBEPBE
basis: SDD
operation: Freq
keyword: #p
keyword: freq=noraman
keyword: PBEPBE/SDD
title: #p freq=noraman PBEPBE/SDD
converged: YES YES NO NO
title: Mulliken charges:
elementType: O O O N C C C C C C C H H H H H H H H H H H H H H H
charge: -0.417404 -0.202158 -0.213174 0.143328 -0.114692 -0.148651 -0.049140 -0.395032 -0.734948 -0.701422 -0.689182 0.260028 0.265425 0.209669 0.235372 0.213855 0.232353 0.219932 0.208853 0.216407 0.210534 0.237267 0.215535 0.224399 0.238404 0.334442
chargesum: 0.00000
title: Mulliken charges with hydrogens summed into heavy atoms:
elementType: O O O N C C C C C C C
charge: -0.082962 -0.202158 -0.213174 0.143328 0.145336 0.116773 0.160529 0.054195 -0.073810 -0.037214 -0.010845
polarizability: 1.02326943e+02 1.85392317e+00 8.73933935e+01 -1.88949327e+00 -1.49075859e+00 9.18620366e+01
1716.lowfreq: -19.4320 -9.6168 -0.0006 -0.0005 0.0005 6.4748 42.1688 56.7693 72.4948
frequency: 41.6690 56.3952 72.4274 94.1236 132.4328 165.4293 193.0354 204.2998 225.9885 232.1654 267.9487 278.5038 295.6087 321.0111 371.1416 399.2339 450.3885 517.3129 586.9475 643.1763 661.9041 769.0512 808.3853 847.7178 897.7304 912.6124 922.9645 956.5363 981.4598 1021.1276 1051.8857 1085.4358 1094.1503 1116.7637 1136.9831 1184.7006 1199.8048 1222.5174 1251.0249 1264.2391 1288.1833 1310.8099 1325.8495 1332.0944 1347.5503 1376.1400 1381.4843 1399.8179 1402.6098 1436.2370 1457.0931 1466.8580 1471.2702 1477.7519 1487.6532 1488.8685 1490.3335 2971.6559 2981.5881 2986.3319 2987.3367 3002.2868 3034.5683 3048.4550 3059.5151 3061.8925 3074.9200 3078.3441 3085.2164 3091.2818 3091.7187 3545.5904
redmass: 6.7149 2.7733 3.8621 2.4243 3.7386 3.7244 1.4366 1.2244 1.1389 2.5289 2.6699 2.0972 1.9956 1.5237 4.1755 2.5515 3.9086 3.5429 3.1560 3.4594 3.6995 2.4418 3.5772 1.9591 1.8952 2.0459 1.4390 1.4089 2.3183 2.8814 1.9656 1.5777 1.8526 2.0931 2.3515 1.8820 1.9059 1.9482 1.5866 1.7942 1.3108 1.2390 1.4726 1.4970 1.4734 1.1690 1.2040 1.2073 1.2072 3.1065 1.1738 1.0442 1.0528 1.0624 1.0454 1.0463 1.0565 1.0371 1.0460 1.0516 1.0557 1.0606 1.0852 1.0900 1.0984 1.0976 1.0990 1.0984 1.0997 1.1005 1.0999 1.0657
irintensity: 0.6128 0.0274 0.3445 1.4303 1.4534 1.2777 2.7041 2.2754 3.0133 0.2186 4.0564 5.8272 48.1965 92.4631 8.6006 3.3426 6.5852 9.2182 7.7180 2.9911 4.4699 26.8714 3.7324 4.1811 18.6281 23.9270 18.0376 1.1793 22.6959 9.9217 9.7949 35.1470 17.4205 9.3737 13.6824 10.6174 18.1058 37.4691 7.9548 33.3910 15.5899 0.2053 2.0722 11.2736 0.7323 17.6652 20.1934 15.1882 8.7937 115.3128 6.9710 5.0282 3.5034 12.7841 22.4641 11.9138 13.2266 25.7990 39.5387 17.5897 15.7826 22.1527 0.5366 6.5662 24.3807 21.0285 13.3234 55.1505 36.4968 18.2893 46.7963 6.7574
temp: 298.150 k
press: 1.00000 atm
elementType: 8 8 8 7 6 6 6 6 6 6 6 1 1 1 1 1 1 1 1 1 1 1 1 1 1 1
symmnumber: 1
zpe: 574073.2 jmol-1
zpe.correction: 0.218653 hartree
zpe.thermalcorrener: 0.232264 hartree
zpe.thermalcorrenthalpy: 0.233208 hartree
zpe.thermalcorrgfe: 0.178437 hartree
zpe.sumelectzpe: -555.168275 hartree
zpe.sumelectthermal: -555.154664 hartree
zpe.sumelectthermalent: -555.153719 hartree
zpe.sumelectthermalfe: -555.208491 hartree
dipole: 3.0844 4.6543 1.0128
dipole: 5.6747
quadrupole: -72.6105 -73.1234 -67.3958
quadrupole: -5.3894 1.3576 -1.8560
quadrupole: -1.5673 -2.0802 3.6474 -5.3894 1.3576 -1.8560
hfenergy: -555.3869277 hartree
pointgroup: C01 [X(C7H15N1O3)]
dipole: -1.2308607 1.8125799 -0.4289363 debye
dipolederiv: -0.7065112 -0.0255214 0.0027017 -0.0876963 -0.6513617 -0.2140229 -0.007808 -0.2631633 -0.2045369 -0.416202 0.1906867 0.1933853 0.2413587 -0.3613805 -0.155201 0.0724181 -0.0326765 -0.6602745 -0.4035295 0.1474479 -0.1331667 0.1714819 -0.3574565 0.1075006 0.0115625 -0.0372513 -0.7121129 0.5523571 -0.4463615 -0.0440105 -0.5759662 0.4646316 0.028165 -0.0556511 0.0430116 1.105157 0.5580689 0.0621217 0.0320924 0.1443458 0.4159424 0.1790458 -0.0528999 0.226779 0.2263116 -0.1145607 0.0120224 0.0067189 0.0623601 0.0426752 -0.0386681 0.1000494 -0.0137295 0.1066694 0.0134055 0.047004 0.0031773 -0.0751165 0.0662033 -0.004753 0.0556854 -0.0034982 0.1330923 0.0048349 0.0041809 0.0101615 -0.0064872 0.1009665 -0.0230981 -0.011397 0.0364114 0.0835902 -0.0081918 0.0412239 0.0001174 0.0638298 0.0405772 0.0719799 -0.0172062 0.0415603 -0.0722327 -0.0502721 -0.0419158 0.0266993 0.0298054 0.0240319 0.0148496 0.0096208 0.0416818 0.0208025 -0.0217472 -0.0395393 0.0156927 -0.0481599 0.0143002 -0.0031016 0.0118679 -0.0208256 0.072465 0.0520199 -0.0030492 -0.0488693 0.0100216 0.0169918 0.0216203 -0.0196056 0.0011192 -0.0697859 0.0467708 0.0215533 0.0007017 0.0236548 0.0251063 -0.0135522 -0.0325176 0.0099544 -0.0752029 0.0577675 -0.0429964 -0.0322544 -0.0659093 -0.1213548 -0.0855391 -0.0587593 -0.0821864 -0.0336336 0.0651909 -0.0365064 0.0273108 -0.034185 0.059678 0.0653454 0.0348913 0.0065574 -0.0900771 -0.0672086 0.085246 -0.0225889 0.1397328 -0.0177852 0.0148147 -0.0263037 0.0097349 0.0760083 -0.0831941 0.1279403 -0.040442 0.1256491 0.0087579 0.0198472 0.0016411 -0.0079048 0.0914036 -0.0647307 -0.1170311 0.1099564 -0.1086547 0.0329943 0.0498019 0.1041339 0.0506317 0.0040216 0.0913511 -0.0266195 -0.0157909 -0.0678937 -0.082826 -0.1408287 -0.0216861 -0.0700657 0.0018657 0.0760139 -0.0040539 -0.0647555 -0.010969 0.0789181 0.05223 -0.0093114 0.0571215 -0.1567151 -0.1352783 0.0990483 0.0089102 0.1302321 -0.0011272 0.0101433 -0.0171763 0.0281413 0.0910485 0.0932844 -0.0259874 -0.0001508 -0.0873605 -0.0534981 -0.0590332 -0.0368366 -0.1046734 0.0397731 0.062 -0.0069981 -0.0242648 -0.0079419 0.0925762 0.0053257 0.0271229 0.0533816 -0.1464225 0.0590026 -0.057702 -0.006494 -0.0879232 -0.1197366 -0.0877128 -0.0226988 -0.1066976 0.0556437 -0.0432455 0.0682701 -0.0149357 0.1317646 0.0148328 0.0455859 -0.0288842 0.0424376 0.0673882 0.3826042 -0.0324636 0.0100977 -0.0099734 0.2673431 0.1392553 -0.0102514 0.0941486 0.0457536 unknown
polarizability: 102.4615384|-1.6673266|87.344647|-1.6636909|1.4287898|91.7761876 unknown
InChI: InChI=1S/C7H15NO3/c1-4-6(8(10)11)7(9)5(2)3/h5-7,9H,4H2,1-3H3
charge 0 multiplicity 1
26 atoms
O  -0.998112 -1.707516 -0.37116
O  2.21199 -1.301857 -1.031735
O  1.94761 -1.082659 1.22296
N  1.647511 -0.797616 0.006252
C  -0.793674 -0.407201 0.289733
C  0.526139 0.235883 -0.221041
C  -2.036524 0.520579 0.159757
C  0.920759 1.555303 0.477118
C  -2.345691 0.913611 -1.305933
C  -3.257479 -0.161789 0.820512
C  2.284238 2.1131 0.015918
H  -0.652322 -0.680941 1.350982
H  0.507404 0.35863 -1.319168
H  -1.81579 1.445663 0.730119
H  0.925846 1.390245 1.570822
H  0.129312 2.295943 0.258212
H  -3.224491 1.581629 -1.341448
H  -1.50718 1.446262 -1.792371
H  -2.5956 0.024813 -1.917358
H  -3.07456 -0.356157 1.893448
H  -4.155905 0.476617 0.736566
H  -3.46721 -1.131558 0.336085
H  2.307237 2.272674 -1.077961
H  2.485428 3.082933 0.50417
H  3.112036 1.430707 0.278159
H  -1.06277 -1.572797 -1.351739
