program: Gaussian 09
title: 000226820
version: EM64L-G09RevD.01
frameworkgroup: C1[X(C5H11NO3)]
method: RPBEPBE
basis: SDD
operation: Freq
keyword: #p
keyword: freq=noraman
keyword: PBEPBE/SDD
title: #p freq=noraman PBEPBE/SDD
converged: YES YES NO NO
title: Mulliken charges:
elementType: O O O N C C C C C H H H H H H H H H H H
charge: -0.415303 -0.204812 -0.197395 0.168277 -0.070925 -0.399951 -0.336660 -0.416751 -0.690732 0.259988 0.202436 0.196594 0.225278 0.203596 0.251798 0.249482 0.209766 0.225484 0.208934 0.330896
chargesum: 0.00000
title: Mulliken charges with hydrogens summed into heavy atoms:
elementType: O O O N C C C C C
charge: -0.084408 -0.204812 -0.197395 0.168277 0.189063 -0.000920 0.092213 0.084530 -0.046548
polarizability: 8.86495846e+01 3.72776759e+00 6.62690406e+01 -6.76014837e-01 -6.96323661e+00 6.64817359e+01
1716.lowfreq: -10.0456 -0.0006 0.0004 0.0007 3.2723 11.3779 39.0243 58.1733 83.9641
frequency: 38.8738 58.0220 83.8217 103.3578 116.4734 199.9456 235.4587 282.4865 310.2084 348.3531 423.2889 447.4389 498.2277 606.5356 686.4959 743.5341 825.1018 845.8147 865.2014 903.8918 962.7224 1018.5923 1053.4260 1074.5755 1094.9363 1121.3072 1156.9821 1211.3852 1231.9431 1254.0427 1275.6868 1302.9792 1314.1839 1333.3803 1353.6808 1377.6308 1393.7441 1431.4377 1439.5614 1457.2822 1476.4334 1478.7111 1487.7665 2950.0103 2973.7772 2986.2491 3007.7816 3034.5326 3042.4102 3060.1483 3072.6992 3077.2711 3116.7943 3535.4161
redmass: 5.6905 5.6637 2.2339 2.6255 3.3261 4.9068 1.1101 4.9551 1.1777 2.3199 2.8237 3.2103 3.1169 5.3616 5.7777 1.1381 2.4284 6.4109 1.5419 1.9835 1.5928 3.1203 2.0490 1.9700 2.1749 2.3714 1.2391 1.4666 4.0661 1.3550 1.2214 1.3288 1.2939 1.5363 1.5904 1.1440 1.2137 1.5487 2.1400 1.0858 1.0494 1.0427 1.0834 1.0616 1.0362 1.0626 1.0951 1.0580 1.0989 1.0878 1.1012 1.0989 1.1070 1.0659
irintensity: 2.1697 0.8076 1.3432 0.1212 2.3834 0.9034 0.0131 2.8633 114.8115 38.0135 5.5893 3.0127 20.4312 28.8763 2.3710 5.9424 22.9463 9.9201 4.9511 11.1274 16.3877 6.6137 30.5279 24.3397 1.3465 40.7959 48.1431 1.9458 91.2945 2.2912 5.5225 3.2499 5.3620 2.6406 2.9628 21.8889 9.8312 83.4927 79.2563 3.8593 3.4141 13.7779 16.3626 21.2159 35.9401 30.8014 13.7711 6.9199 3.3108 4.6208 82.5463 44.9943 8.3376 6.3003
temp: 298.150 k
press: 1.00000 atm
elementType: 8 8 8 7 6 6 6 6 6 1 1 1 1 1 1 1 1 1 1 1
symmnumber: 1
zpe: 429351.8 jmol-1
zpe.correction: 0.163531 hartree
zpe.thermalcorrener: 0.174272 hartree
zpe.thermalcorrenthalpy: 0.175216 hartree
zpe.thermalcorrgfe: 0.126122 hartree
zpe.sumelectzpe: -476.717161 hartree
zpe.sumelectthermal: -476.706421 hartree
zpe.sumelectthermalent: -476.705477 hartree
zpe.sumelectthermalfe: -476.754571 hartree
dipole: -4.5274 -1.0876 -3.1024
dipole: 5.5951
quadrupole: -67.9175 -53.5594 -55.8702
quadrupole: -1.7626 -3.0026 -0.9741
quadrupole: -8.8018 5.5563 3.2455 -1.7626 -3.0026 -0.9741
hfenergy: -476.8806928 hartree
pointgroup: C01 [X(C5H11N1O3)]
dipole: -1.7847827 0.6258837 1.1262522 debye
dipolederiv: -0.6874378 0.0460999 -0.0624715 -0.0546917 -0.7404055 -0.1157667 -0.1082723 -0.0744481 -0.1053914 -0.4943316 0.0014442 0.1516749 0.1280325 -0.3722649 0.1850629 0.0500102 0.2659348 -0.6431021 -0.5846964 0.2001266 -0.1714919 0.2571291 -0.3756132 0.2451411 0.0237796 0.1649047 -0.520611 0.9352686 -0.2559101 -0.083527 -0.5241423 0.4639573 -0.4330667 -0.2293881 -0.4615172 0.9274866 0.570319 0.0297996 0.0484482 0.1412931 0.666676 0.0344459 0.1770173 0.0267178 0.1535473 -0.1755369 0.0439075 0.0073585 -0.0526411 0.0696851 -0.0584043 -0.0777439 -0.0967134 0.093061 0.0411435 0.0031897 0.0146548 0.0723028 0.1124489 -0.0324089 0.0955101 -0.0465073 0.106521 -0.2660047 -0.0257539 0.0146333 0.0720215 0.0799175 -0.0064481 -0.0476742 -0.045896 0.0910925 -0.0767185 0.0124457 0.0172564 -0.014413 0.0982511 -0.0142042 -0.0298627 -0.0118509 0.0614917 0.0695427 -0.0128455 0.013713 0.0054126 -0.0002959 0.0272354 0.0056205 0.0449313 -0.0448355 0.0523587 0.003682 -0.0040555 -0.0173646 -0.1709055 -0.060405 -0.0132096 -0.0326021 0.065872 0.0407758 0.0156895 -0.0078593 -0.0043251 0.0262149 0.114363 0.0036422 0.0770495 -0.1410121 0.0673311 0.0260355 0.0114165 -0.0067326 -0.1256674 -0.0635646 -0.0034005 -0.0326557 0.0644715 0.0201292 -0.0278068 0.0465819 -0.019405 0.030862 0.1128156 0.0175893 0.0859931 -0.1301563 0.0732179 -0.0131586 0.0192867 0.0066306 -0.0633201 -0.0301523 0.0611039 0.0150752 0.0952665 0.0157271 0.006027 0.0159759 0.0143038 0.0720609 0.0796143 0.0338548 0.0340649 -0.0301954 0.0719019 0.0127057 0.0061791 -0.0122742 0.0217413 0.1198257 0.0713091 0.1062817 -0.1186291 -0.1326102 -0.0382964 -0.1009155 -0.054 0.084702 -0.0453259 -0.1293452 -0.0428361 0.0016652 0.0709041 -0.0097324 0.0132372 0.0584708 -0.1728836 -0.0610848 0.0366791 -0.0506597 0.0742902 0.3887165 -0.0176494 0.0499046 0.0043925 0.2948389 0.0023277 0.0627803 0.0747336 -0.0008326 unknown
polarizability: 88.511325|-3.8746256|64.3943887|1.331571|-6.7028107|68.4946474 unknown
InChI: InChI=1S/C5H11NO3/c1-2-3-5(7)4-6(8)9/h5,7H,2-4H2,1H3
charge 0 multiplicity 1
20 atoms
O  -0.067762 -1.4917 -0.305049
O  2.548298 0.708241 -1.074929
O  3.094767 -0.566509 0.741058
N  2.302919 0.201049 0.081401
C  -0.196847 -0.034805 -0.159297
C  -1.566663 0.379718 0.419779
C  -2.744242 -0.035341 -0.491391
C  0.953956 0.532164 0.702593
C  -4.116957 0.278322 0.139775
H  -0.083144 0.339102 -1.191907
H  -1.585551 1.478977 0.567324
H  -1.694522 -0.075795 1.425977
H  -2.664162 -1.116218 -0.71295
H  -2.65109 0.489493 -1.463088
H  0.894597 1.63296 0.746018
H  0.964237 0.106546 1.719146
H  -4.253112 -0.269152 1.091727
H  -4.941141 -0.013529 -0.535782
H  -4.224588 1.358384 0.355046
H  -0.201692 -1.923007 0.578848
