program: Gaussian 09
title: 000226816
version: EM64L-G09RevD.01
frameworkgroup: C1[X(C3H6BrNO2)]
method: RPBEPBE
basis: SDD
operation: Freq
keyword: #p
keyword: freq=noraman
keyword: PBEPBE/SDD
title: #p freq=noraman PBEPBE/SDD
converged: NO YES NO NO
title: Mulliken charges:
elementType: Br O O N C C C H H H H H H
charge: 0.071942 -0.181837 -0.180155 0.173462 -0.320360 -0.415162 -0.669701 0.266035 0.238625 0.322702 0.236782 0.219111 0.238558
chargesum: 0.00000
title: Mulliken charges with hydrogens summed into heavy atoms:
elementType: Br O O N C C C
charge: 0.071942 -0.181837 -0.180155 0.173462 0.184299 -0.092459 0.024749
polarizability: 7.86282563e+01 9.31761753e-01 5.45671208e+01 -2.99099314e+00 -4.45339617e+00 5.36656842e+01
1716.lowfreq: -10.3144 -5.5864 0.0007 0.0008 0.0009 6.3335 41.9597 99.6459 158.4489
frequency: 41.8807 99.6383 158.4478 173.4484 200.8194 284.0264 298.9765 451.7677 585.8613 603.2044 733.4342 767.1663 829.3134 915.9298 1031.1932 1077.6395 1124.6073 1186.5911 1214.4113 1237.6126 1286.8363 1330.0228 1397.8439 1431.9800 1457.7672 1476.9990 1485.0212 2991.8710 3024.8308 3076.1641 3094.7685 3099.8425 3122.6367
redmass: 11.8623 2.2776 6.8241 3.7787 1.3368 3.0396 4.1800 4.7761 4.1310 5.6301 5.1469 3.1869 1.7220 1.9332 2.4009 1.5816 2.1882 1.6610 2.4884 1.6393 1.1855 1.4103 1.2195 3.1258 1.2114 1.0522 1.0475 1.0360 1.0610 1.1009 1.0993 1.1011 1.0899
irintensity: 0.2184 0.6394 1.7909 1.3305 1.2347 2.9827 3.8604 7.6422 8.0013 19.7291 20.8314 29.2205 2.0410 19.7625 3.8299 17.8970 5.0165 32.6161 54.3248 28.2510 9.0925 13.4671 13.5767 116.1948 9.0195 14.8879 14.9356 21.1134 7.1305 3.5290 20.8444 22.4657 2.5418
temp: 298.150 k
press: 1.00000 atm
elementType: 35 8 8 7 6 6 6 1 1 1 1 1 1
symmnumber: 1
zpe: 246984.3 jmol-1
zpe.correction: 0.094071 hartree
zpe.thermalcorrener: 0.102226 hartree
zpe.thermalcorrenthalpy: 0.103170 hartree
zpe.thermalcorrgfe: 0.059379 hartree
zpe.sumelectzpe: -335.921510 hartree
zpe.sumelectthermal: -335.913356 hartree
zpe.sumelectthermalent: -335.912412 hartree
zpe.sumelectthermalfe: -335.956202 hartree
dipole: 0.5483 -3.7347 -1.0457
dipole: 3.9169
quadrupole: -49.7042 -54.2193 -52.9643
quadrupole: -5.6422 -1.2126 0.3068
quadrupole: 2.5917 -1.9234 -0.6684 -5.6422 -1.2126 0.3068
hfenergy: -336.0155812 hartree
pointgroup: C01 [X(C3H6Br1N1O2)]
dipole: 1.4168624 0.4699923 0.3826422 debye
dipolederiv: -0.2579691 0.1812092 0.0125866 0.1971415 -0.4250421 -0.026043 -0.0226412 0.0279041 -0.0582717 -0.3326431 -0.2490789 0.1745656 -0.2190979 -0.4455098 0.1862295 0.0679773 0.012003 -0.6032084 -0.3031474 -0.1679713 -0.0534091 -0.126129 -0.372279 -0.1180634 0.1188099 -0.0211954 -0.7330176 0.304303 0.5726974 -0.1037813 0.42571 0.6248526 -0.0439742 -0.1723884 0.0960945 1.1289466 -0.0352342 0.015869 0.0409369 0.1391532 -0.1355024 -0.00154 -0.0354173 0.0200303 0.0366255 0.5603431 -0.3974106 -0.0320084 -0.3693291 0.6399001 -0.0436737 -0.0064142 -0.0730148 0.1050587 -0.0735241 0.102912 0.0196839 -0.0418054 0.0619315 0.0133005 0.0877968 -0.042938 0.0799993 0.0819312 0.0510296 -0.0538653 0.0299377 0.0895274 0.0176409 -0.0110307 0.039204 -0.0434836 0.0130478 -0.0650813 -0.0266716 -0.0528034 -0.0524516 -0.0491535 -0.0145187 -0.0554919 0.0923994 0.001969 0.0242734 -0.0031663 0.0232793 -0.0543907 0.0777005 -0.0087031 -0.0093846 0.0071282 -0.1191532 0.0344979 0.0866253 0.0303172 0.0596587 0.0154514 0.0983776 0.0145101 0.0682337 0.1016055 0.0105043 -0.0007057 0.0193205 0.0673786 0.0090197 -0.0590452 0.0489388 -0.1414337 0.0584716 -0.1134507 -0.0607907 -0.0556945 -0.0580734 -0.0368949 -0.0428028 -0.05666 0.0610236 unknown
polarizability: 58.7976619|-9.3868472|74.6459416|-3.3848834|-2.9602214|53.4174577 unknown
InChI: InChI=1S/C3H6BrNO2/c1-2-3(4)5(6)7/h3H,2H2,1H3
charge 0 multiplicity 1
13 atoms
Br -0.856739 2.295151 0.19581
O  -1.390786 -1.269988 0.865724
O  -0.848223 -0.774695 -1.298433
N  -0.780672 -0.581415 -0.033674
C  1.483362 0.548541 -0.226714
C  0.131107 0.556276 0.481656
C  2.27848 -0.749434 0.054676
H  1.316442 0.674562 -1.310522
H  2.048525 1.427931 0.130519
H  0.17485 0.417386 1.571391
H  3.265229 -0.688943 -0.435811
H  2.446863 -0.900094 1.13643
H  1.761662 -1.639478 -0.345051
