program: Gaussian 09
title: 000226797
version: EM64L-G09RevD.01
frameworkgroup: C1[X(C17H18N2O2)]
method: RPBEPBE
basis: SDD
operation: Freq
keyword: #p
keyword: freq=noraman
keyword: PBEPBE/SDD
title: #p freq=noraman PBEPBE/SDD
converged: YES YES NO NO
title: Mulliken charges:
elementType: O O N N C C C C C C C C C C C C C C C C C H H H H H H H H H H H H H H H H H H
charge: -0.227494 -0.191784 -0.437847 -0.472698 -0.314866 0.475375 0.370089 -0.390841 -0.369509 -0.409431 -0.417016 0.310899 -0.238855 -0.239821 -0.232670 -0.223907 -0.242491 -0.246694 0.271329 -0.519076 -0.660656 0.275199 0.298706 0.253680 0.254566 0.264519 0.246008 0.226694 0.228488 0.230710 0.224953 0.230619 0.230280 0.299758 0.208430 0.247955 0.213191 0.220376 0.253836
chargesum: 0.00000
title: Mulliken charges with hydrogens summed into heavy atoms:
elementType: O O N N C C C C C C C C C C C C C C C C C
charge: -0.227494 -0.191784 -0.139140 -0.172941 -0.039667 0.475375 0.370089 -0.137161 -0.114943 -0.144912 -0.171008 0.310899 -0.012162 -0.011333 -0.001960 0.001046 -0.011872 -0.016414 0.271329 -0.062692 0.026746
polarizability: 2.33760937e+02 -5.43898727e+00 2.22013481e+02 -1.42269347e+01 1.63573527e+01 1.45138744e+02
1716.lowfreq: -3.7572 -0.0005 0.0001 0.0003 4.0152 7.4765 12.6576 25.4665 28.8712
frequency: 12.0134 25.4004 28.7260 30.3909 50.1211 51.3969 63.7358 76.3510 112.9067 134.4540 194.6148 204.2089 217.3492 222.3107 255.6520 280.3869 296.9160 322.3955 362.3377 402.8984 406.5243 433.8159 469.8785 512.8419 530.8555 562.0588 595.5776 610.4913 614.3744 617.2790 630.6623 653.2057 701.3460 706.0484 707.8648 719.6508 751.5639 773.2675 797.9505 837.1700 858.6325 863.1445 865.1039 899.2840 928.9184 936.2772 965.9595 982.6529 984.6349 990.8198 991.7916 998.5949 999.8574 1015.3439 1026.3752 1029.0416 1053.8062 1077.8566 1083.8348 1085.2269 1098.3900 1149.6247 1171.9498 1173.6420 1185.9313 1191.1697 1191.9161 1200.7567 1218.3462 1252.5895 1268.3687 1299.6618 1321.3733 1332.8003 1342.3623 1380.7238 1383.7787 1394.9588 1424.8503 1434.9402 1442.7610 1445.0361 1459.2983 1470.6448 1481.4566 1483.4283 1484.6240 1589.5790 1594.6193 1611.2789 1614.4571 1643.5007 1682.8835 2971.2957 2998.1401 3006.0889 3021.7505 3093.2669 3107.6524 3118.1661 3123.2138 3126.7794 3129.6097 3136.4301 3142.5047 3147.4628 3149.8918 3164.0611 3164.9987 3515.8575 3523.1572
redmass: 2.8273 4.9745 3.2627 4.2817 4.0258 7.9084 4.4007 4.5007 3.5550 5.0718 1.2299 4.9007 4.7954 4.0574 5.0144 5.0609 4.8971 3.9708 4.6560 2.8320 2.8577 4.0804 3.1346 1.5853 3.2564 3.0265 1.2892 4.0248 5.5556 6.3212 3.8979 4.5493 5.5306 1.9906 1.9586 3.6758 1.8013 1.9568 1.4480 3.4687 1.2634 1.2560 3.7673 4.1379 1.5994 1.4881 4.3880 1.4899 1.5434 5.0109 3.7102 1.3267 1.3433 2.0782 2.2733 2.1357 2.5833 1.6565 1.6445 1.9070 2.6084 2.1597 1.0574 1.0632 1.5297 1.1416 1.7560 2.2383 2.2775 1.2025 1.5947 1.3941 1.3285 1.6332 1.2910 7.3323 6.6001 1.2007 1.9507 2.2304 1.0959 2.1519 1.6243 1.0438 2.2430 2.2531 1.0518 6.0410 6.2293 5.9684 6.1080 4.9284 9.7197 1.0593 1.0365 1.0819 1.0998 1.1007 1.1000 1.0863 1.0844 1.0871 1.0874 1.0920 1.0919 1.0962 1.0959 1.1014 1.1015 1.0771 1.0767
irintensity: 4.2682 8.3222 0.0709 1.5655 0.3393 1.4083 1.9976 0.1943 3.3064 1.4341 2.7510 1.3327 0.4794 4.1959 10.6978 2.8834 0.0432 1.3128 1.7428 0.2506 0.4388 7.8425 18.0847 68.6279 16.5103 23.0428 86.8889 73.0715 13.6578 0.7341 19.0172 6.3488 23.3958 51.9053 36.0597 12.6857 70.3661 30.2528 15.8803 8.4690 0.5852 0.4259 15.5071 12.0842 5.2598 3.8132 0.9890 0.3358 0.1183 0.9139 0.6957 0.6139 1.4143 6.5630 9.3959 15.3678 59.1312 3.5595 12.3835 2.2921 13.7672 408.5689 0.1014 0.2072 1.4798 2.2538 4.8604 76.5952 12.2400 4.2636 9.6890 68.3694 18.5178 6.3230 3.6308 0.6880 0.8610 26.2901 642.7370 6.7441 35.1635 12.4192 334.6422 9.5524 13.7846 25.4734 11.7048 3.2289 0.5027 6.0597 8.8255 32.4407 276.9259 28.0828 30.4659 13.7685 17.1342 35.5242 19.5323 5.7461 2.3914 0.0896 0.7559 13.6959 16.7355 27.8447 39.9871 29.9333 19.0405 3.9793 17.6752
temp: 298.150 k
press: 1.00000 atm
elementType: 8 8 7 7 6 6 6 6 6 6 6 6 6 6 6 6 6 6 6 6 6 1 1 1 1 1 1 1 1 1 1 1 1 1 1 1 1 1 1
symmnumber: 1
zpe: 823486.4 jmol-1
zpe.correction: 0.313649 hartree
zpe.thermalcorrener: 0.333492 hartree
zpe.thermalcorrenthalpy: 0.334436 hartree
zpe.thermalcorrgfe: 0.260735 hartree
zpe.sumelectzpe: -917.076396 hartree
zpe.sumelectthermal: -917.056554 hartree
zpe.sumelectthermalent: -917.055609 hartree
zpe.sumelectthermalfe: -917.129311 hartree
dipole: 2.0157 -2.2843 -5.5530
dipole: 6.3338
quadrupole: -120.5401 -110.4522 -127.2003
quadrupole: 10.9236 13.5404 3.0722
quadrupole: -1.1426 8.9454 -7.8028 10.9236 13.5404 3.0722
hfenergy: -917.3900459 hartree
pointgroup: C01 [X(C17H18N2O2)]
dipole: -0.6065811 -0.7624835 2.2935262 debye
polarizability: 230.0708438|8.5437014|218.6705863|-4.3732427|-30.8919434|152.1717328 unknown
InChI: InChI=1S/C17H18N2O2/c1-2-15(20)18-17(21)19-16(13-9-5-3-6-10-13)14-11-7-4-8-12-14/h3-12,16,18-19H,2H2,1H3
charge 0 multiplicity 1
39 atoms
O  1.732218 0.288821 -1.763321
O  4.193544 1.73356 -0.960813
N  0.573508 -0.195754 0.214749
N  2.864585 0.280248 0.331132
C  -0.731591 -0.368712 -0.469492
C  -1.559779 0.920609 -0.330633
C  -1.445398 -1.653633 -0.021588
C  -2.374431 1.167599 0.80399
C  -2.82356 -1.836834 -0.308948
C  -1.436076 1.92747 -1.320747
C  -0.736829 -2.712757 0.596804
C  1.712968 0.15359 -0.514684
C  -3.052147 2.398921 0.945178
C  -3.476021 -3.043141 0.024854
C  -2.116968 3.157501 -1.183082
C  -1.389748 -3.919349 0.938416
C  -2.926727 3.397636 -0.048907
C  -2.763355 -4.089632 0.655614
C  4.06105 0.976811 0.028773
C  5.190584 0.694068 1.035073
C  6.208809 1.847946 1.104525
H  -0.463989 -0.478953 -1.538752
H  0.544282 -0.010198 1.220708
H  -2.4925 0.390479 1.569112
H  -3.386164 -1.032729 -0.796405
H  -0.790609 1.749062 -2.189018
H  0.333887 -2.594812 0.794955
H  -3.680002 2.578392 1.825373
H  -4.539785 -3.166681 -0.207509
H  -2.013419 3.926468 -1.956564
H  -0.824292 -4.727139 1.417026
H  -3.455151 4.351509 0.059189
H  -3.270502 -5.024998 0.917116
H  2.844763 -0.225823 1.220438
H  4.774928 0.477065 2.039474
H  5.698276 -0.233436 0.69922
H  7.076128 1.567594 1.727705
H  5.751383 2.757746 1.531234
H  6.564028 2.099687 0.091606
