program: Gaussian 09
title: 000226796
version: EM64L-G09RevD.01
frameworkgroup: C1[X(C15H15NO2)]
method: RPBEPBE
basis: SDD
operation: Freq
keyword: #p
keyword: freq=noraman
keyword: PBEPBE/SDD
title: #p freq=noraman PBEPBE/SDD
converged: YES YES NO NO
title: Mulliken charges:
elementType: O O N C C C C C C C C C C C C C C C H H H H H H H H H H H H H H H
charge: -0.328630 -0.273582 -0.469906 0.300483 0.191139 -0.325865 0.249833 -0.328165 0.131835 -0.234984 -0.250664 -0.232535 -0.341838 -0.348015 -0.225565 -0.242519 -0.687585 -0.228599 0.352917 0.311578 0.242763 0.227244 0.224709 0.214329 0.212869 0.275527 0.216181 0.231913 0.228070 0.214815 0.228174 0.232239 0.231835
chargesum: 0.00000
title: Mulliken charges with hydrogens summed into heavy atoms:
elementType: O O N C C C C C C C C C C C C C C C
charge: -0.328630 -0.273582 -0.116989 0.300483 0.191139 -0.014287 0.249833 -0.085402 0.131835 -0.007741 -0.025955 0.194662 -0.066311 -0.131833 0.006348 -0.014449 -0.012356 0.003236
polarizability: 2.77064467e+02 -1.54860439e+01 2.00986861e+02 -6.13531138e+00 -7.41827206e+00 8.15226987e+01
1716.lowfreq: 0.0006 0.0007 0.0008 3.8333 6.6556 8.8520 23.1215 42.4536 56.7341
frequency: 22.8928 42.4094 56.7272 65.9546 88.3603 114.9450 131.2644 159.9227 200.7919 221.1197 245.6336 252.0397 302.1948 312.4245 335.8357 400.8547 419.9910 457.5638 468.7327 485.0270 558.8415 570.1926 592.3190 614.5109 672.8191 684.1321 697.7796 720.3936 743.5757 754.8295 758.7666 790.7847 825.0089 826.9702 853.8184 858.6953 870.3178 910.5481 934.7287 939.3298 983.8461 987.3831 988.9232 1005.9255 1024.2984 1039.2862 1041.2665 1079.4081 1087.9463 1113.6753 1118.2267 1139.3650 1172.9582 1173.0116 1190.5247 1193.3461 1250.1094 1255.8147 1263.5470 1301.7147 1320.8511 1368.3367 1384.9661 1393.6062 1401.5221 1432.5964 1439.9506 1463.5762 1467.8012 1479.0751 1484.5214 1495.4923 1520.4984 1571.4335 1602.7080 1604.4498 1610.1556 1613.3419 2963.9436 2996.6950 3022.7239 3094.8497 3103.9907 3116.0145 3131.0773 3135.9274 3144.2532 3154.7534 3157.5605 3169.2728 3171.0627 3195.3621 3508.4042
redmass: 3.7491 5.3465 4.3862 4.2649 3.5828 2.0327 4.2722 4.7194 4.9669 4.4346 1.3071 4.0848 5.5598 5.0611 3.9904 2.8061 4.8734 3.6538 4.0927 5.2632 3.8093 6.2172 6.4451 6.4268 5.9987 4.9667 1.4729 1.6006 2.3046 1.2548 4.5244 2.4799 4.5001 1.1302 1.2942 1.3434 5.8701 3.2411 1.4479 1.3458 1.4020 1.2974 5.6759 1.3433 2.5088 2.9609 2.0753 2.3496 1.9367 2.3039 1.9791 1.4394 1.0622 1.0610 1.6203 1.4717 3.6496 1.8203 1.1379 1.7032 1.3860 1.3874 8.7608 2.7512 1.6366 2.2824 2.4591 1.0401 2.0939 1.2297 1.6360 1.2628 2.4106 6.1880 6.3504 6.5246 5.0935 6.0050 1.0557 1.0361 1.1077 1.0989 1.1016 1.0874 1.0870 1.0858 1.0920 1.0918 1.0957 1.1004 1.0970 1.0953 1.0756
irintensity: 0.0064 2.1858 0.5407 0.7900 1.3003 5.4873 0.2446 1.5183 3.3469 0.5662 1.6130 2.2908 5.4731 4.7014 1.5363 0.1017 1.3015 4.6561 5.9546 2.1151 2.4442 21.5073 4.7473 0.7871 7.5842 3.8609 38.2918 47.1800 12.5664 184.0958 8.7311 14.5633 2.1052 0.8161 0.2465 2.7246 17.7920 30.5919 2.3555 8.0494 1.3220 4.1735 0.3854 1.9234 11.4949 61.3446 27.8812 10.7107 43.0896 5.9690 44.1750 4.5664 4.5316 2.5100 41.0554 47.7193 60.7857 128.2551 0.0375 47.6513 10.9111 40.6649 0.9731 27.7066 35.9476 17.9181 155.2930 13.1956 59.8035 20.9179 31.0809 13.9926 513.9006 66.9937 58.1539 9.7363 22.6712 13.7357 46.6575 18.2120 29.8689 32.1923 35.5212 11.4650 1.5746 1.3446 23.1316 26.8266 16.7657 26.9567 17.8194 7.6978 46.6250
temp: 298.150 k
press: 1.00000 atm
elementType: 8 8 7 6 6 6 6 6 6 6 6 6 6 6 6 6 6 6 1 1 1 1 1 1 1 1 1 1 1 1 1 1 1
symmnumber: 1
zpe: 694398.7 jmol-1
zpe.correction: 0.264482 hartree
zpe.thermalcorrener: 0.280623 hartree
zpe.thermalcorrenthalpy: 0.281567 hartree
zpe.thermalcorrgfe: 0.219214 hartree
zpe.sumelectzpe: -784.523798 hartree
zpe.sumelectthermal: -784.507657 hartree
zpe.sumelectthermalent: -784.506713 hartree
zpe.sumelectthermalfe: -784.569066 hartree
dipole: 1.3330 5.2246 0.1591
dipole: 5.3943
quadrupole: -83.4851 -98.9439 -111.0803
quadrupole: 1.2745 -1.0364 -1.8461
quadrupole: 14.3514 -1.1075 -13.2439 1.2745 -1.0364 -1.8461
hfenergy: -784.7882806 hartree
pointgroup: C01 [X(C15H15N1O2)]
dipole: 0.4369744 -2.076009 0.0582884 debye
polarizability: 277.7258753|12.9689754|198.7213703|11.0939279|-13.3589386|83.1267807 unknown
InChI: InChI=1S/C15H15NO2/c1-2-18-14-11-7-6-10-13(14)16-15(17)12-8-4-3-5-9-12/h3-11,16H,2H2,1H3
charge 0 multiplicity 1
33 atoms
O  1.789303 -1.616888 0.104346
O  -0.993963 2.442301 -0.108867
N  0.069657 0.356044 0.018826
C  1.432154 0.740009 0.066657
C  2.37802 -0.333273 0.113755
C  1.903292 2.074604 0.071629
C  -2.380505 0.450256 -0.023916
C  3.761303 -0.076935 0.164892
C  -1.055079 1.173569 -0.03645
C  3.293857 2.327297 0.125904
C  4.219112 1.263539 0.171541
C  2.679655 -2.792587 0.138195
C  -3.514685 1.177864 -0.467842
C  -2.551273 -0.885061 0.430666
C  -4.790748 0.579079 -0.480639
C  -3.83057 -1.482931 0.42137
C  1.787709 -4.030972 0.122465
C  -4.952525 -0.755871 -0.039621
H  -0.063055 -0.65909 -0.006549
H  1.175295 2.886396 0.029308
H  4.48263 -0.898384 0.199503
H  3.648492 3.363251 0.129718
H  5.294762 1.465413 0.211248
H  3.349663 -2.765129 -0.744883
H  3.299476 -2.7526 1.056803
H  -3.364861 2.213504 -0.789768
H  -1.706736 -1.460452 0.829888
H  -5.657823 1.149784 -0.830657
H  -3.953862 -2.509934 0.782441
H  2.409949 -4.943818 0.144863
H  1.120851 -4.044331 1.001736
H  1.167372 -4.055472 -0.789811
H  -5.943966 -1.222283 -0.045951
