program: Gaussian 09
title: 000226789
version: EM64L-G09RevD.01
frameworkgroup: C1[X(C9H13N3O2)]
method: RPBEPBE
basis: SDD
operation: Freq
keyword: #p
keyword: freq=noraman
keyword: PBEPBE/SDD
title: #p freq=noraman PBEPBE/SDD
converged: YES YES NO NO
title: Mulliken charges:
elementType: O O N N N C C C C C C C C C H H H H H H H H H H H H H
charge: -0.255189 -0.248030 0.038684 -0.387364 -0.651815 -0.499661 -0.358944 0.049546 0.247494 -0.679317 -0.369042 -0.258405 -0.181102 0.295981 0.261416 0.188109 0.203475 0.235904 0.226554 0.199381 0.220444 0.287304 0.253462 0.258134 0.277900 0.299930 0.345152
chargesum: 0.00000
title: Mulliken charges with hydrogens summed into heavy atoms:
elementType: O O N N N C C C C C C C C C
charge: -0.255189 -0.248030 0.038684 -0.109464 -0.006733 -0.050136 0.080435 0.049546 0.247494 -0.032938 -0.081738 -0.004944 0.077032 0.295981
polarizability: 2.18520340e+02 7.34399773e+00 1.35109290e+02 -1.35433611e+00 -1.05744131e+01 7.02907879e+01
1716.lowfreq: -6.4204 -0.0008 -0.0005 0.0005 4.0054 7.5762 29.8499 34.9494 51.0247
frequency: 29.8379 34.4842 51.0096 67.6603 79.4762 81.0822 160.1156 189.0537 208.7807 227.0840 259.8644 279.8838 313.9067 334.0517 358.4433 455.5916 481.7804 508.6397 531.5114 581.6381 590.7045 638.4162 674.7319 708.2633 714.6506 723.0970 752.9247 828.5662 863.4909 871.6840 876.2397 889.9545 891.9340 928.6583 997.1689 1019.5750 1041.8253 1046.9288 1053.4264 1090.6539 1109.4994 1136.6691 1141.4906 1206.5040 1223.2633 1276.6699 1287.1443 1289.8859 1319.1713 1341.6601 1364.4723 1391.3554 1461.3333 1474.4579 1475.5270 1478.3441 1487.5513 1504.1596 1559.1677 1580.5136 1604.5369 1683.3197 2956.8467 2973.8710 2986.3582 3036.6044 3063.5488 3074.9200 3079.8013 3221.8752 3245.8852 3268.0688 3407.8974 3538.3027 3696.5105
redmass: 4.2715 3.5175 4.5020 4.7146 1.7273 4.9981 5.5544 2.7719 3.2171 1.2663 1.9542 2.9761 4.2536 2.9751 3.1086 3.7379 1.1621 3.3413 1.5026 3.4421 3.1939 5.2932 4.4110 7.3047 1.3421 2.1170 1.4224 1.3060 3.2327 4.3640 1.4750 2.1447 1.5201 2.8364 1.7972 2.2933 2.4950 2.3927 2.6385 2.1701 1.9230 1.9803 3.4207 1.6964 1.4190 1.3361 1.4324 2.0337 2.5067 1.4654 2.7060 1.2117 1.6920 1.0489 2.0752 1.0904 1.2273 1.3513 8.6227 6.8830 1.2225 5.3939 1.0690 1.0362 1.0635 1.0960 1.0944 1.0992 1.0999 1.0916 1.0992 1.1080 1.0745 1.0460 1.1034
irintensity: 18.4682 0.2022 1.1822 2.9595 0.5839 7.1762 0.2831 2.3571 1.2400 0.2225 11.0727 4.5113 1.4984 1.1161 46.7511 18.6269 259.9986 11.6226 66.9498 3.9728 35.2682 4.3918 6.8246 7.0180 87.7016 11.3490 1.8159 34.5425 15.0521 1.6651 5.5508 3.7611 4.2996 4.3030 41.4208 4.0189 37.6063 17.0713 24.1716 17.7737 3.8308 19.4272 133.9807 0.9274 6.2706 1.5659 114.3852 390.3528 29.7293 8.8680 7.6054 10.3058 212.8412 2.4870 6.4189 22.4690 77.6019 187.2983 25.6413 38.5492 131.7401 285.4589 26.8648 40.1660 24.8523 2.1314 8.2799 50.4385 46.7610 6.0704 0.5769 0.0856 10.0460 57.3597 46.5405
temp: 298.150 k
press: 1.00000 atm
elementType: 8 8 7 7 7 6 6 6 6 6 6 6 6 6 1 1 1 1 1 1 1 1 1 1 1 1 1
symmnumber: 1
zpe: 564541.5 jmol-1
zpe.correction: 0.215023 hartree
zpe.thermalcorrener: 0.229846 hartree
zpe.thermalcorrenthalpy: 0.230791 hartree
zpe.thermalcorrgfe: 0.171129 hartree
zpe.sumelectzpe: -664.363971 hartree
zpe.sumelectthermal: -664.349147 hartree
zpe.sumelectthermalent: -664.348202 hartree
zpe.sumelectthermalfe: -664.407864 hartree
dipole: 0.4174 5.2289 -1.0330
dipole: 5.3463
quadrupole: -61.2814 -86.6620 -86.1750
quadrupole: 16.1465 -4.5088 -0.6498
quadrupole: 16.7581 -8.6225 -8.1355 16.1465 -4.5088 -0.6498
hfenergy: -664.578993 hartree
pointgroup: C01 [X(C9H13N3O2)]
dipole: -0.153969 2.0569082 0.4118847 debye
polarizability: 218.4452311|-7.7370599|135.1268894|-1.4275244|10.7552241|70.3482978 unknown
InChI: InChI=1S/C9H13N3O2/c1-2-4-7(11-12-9(10)13)8-5-3-6-14-8/h3,5-6,12H,2,4,10H2,1H3
charge 0 multiplicity 1
27 atoms
O  2.684961 0.232199 0.32675
O  -3.210202 -2.07995 -0.331375
N  -0.8341 -0.625947 0.061174
N  -2.084168 -0.057845 0.180928
N  -4.422408 -0.149184 0.164378
C  0.219288 1.619751 0.622986
C  0.113298 2.534618 -0.632913
C  0.232305 0.137504 0.270547
C  1.514569 -0.538907 0.099841
C  0.051904 4.029635 -0.256221
C  1.885035 -1.833762 -0.257468
C  3.326243 -1.884119 -0.2547
C  3.779297 -0.62239 0.100707
C  -3.234797 -0.864337 -0.018926
H  1.148763 1.868988 1.162408
H  -0.613868 1.850766 1.321133
H  -0.776863 2.258003 -1.23229
H  0.991613 2.34581 -1.277821
H  -0.018455 4.66597 -1.156835
H  -0.826285 4.249123 0.381261
H  0.955796 4.334411 0.303087
H  1.188116 -2.635465 -0.489036
H  3.94857 -2.746465 -0.48613
H  4.759834 -0.175089 0.235944
H  -2.196108 0.93449 0.427232
H  -4.472002 0.830728 0.435524
H  -5.286734 -0.666436 0.026914
