program: Gaussian 09
title: 000226777
version: EM64L-G09RevD.01
frameworkgroup: C1[X(C14H14O3)]
method: RPBEPBE
basis: SDD
operation: Freq
keyword: #pfreq=noraman
keyword: PBEPBE/SDD
title: #p freq=noraman PBEPBE/SDD
converged: NO NO NO NO
title: Mulliken charges:
elementType: O O O C C C C C C C C C C C C C C H H H H H H H H H H H H H H
charge: -0.262151 -0.287184 -0.263889 0.383384 0.423494 -0.543300 0.225766 -0.408659 -0.558114 -0.418394 -0.359023 0.333479 -0.362373 0.171774 -0.220492 -0.675113 -0.537275 0.278841 0.240330 0.264031 0.242697 0.269864 0.244153 0.227682 0.227697 0.211113 0.229070 0.229068 0.248139 0.222694 0.222692
chargesum: 0.00000
title: Mulliken charges with hydrogens summed into heavy atoms:
elementType: O O O C C C C C C C C C C C C C C
charge: -0.262151 -0.287184 -0.263889 0.383384 0.423494 -0.264459 0.225766 -0.168329 -0.294083 -0.175697 -0.089159 0.333479 -0.118220 0.171774 0.234886 -0.005863 0.156249
polarizability: 3.20238737e+02 -4.41393055e+00 1.56019601e+02 -1.57603650e-03 5.23043792e-03 7.78221445e+01
1716.lowfreq: -5.8310 -0.0010 -0.0004 0.0006 4.7255 19.5768 32.3647 53.9421 73.4640
frequency: 32.3391 53.8791 73.3978 77.1781 85.5562 123.5723 166.3922 184.7667 197.0438 231.8718 243.9421 255.4237 257.0500 328.7173 342.0504 367.5461 409.3576 430.7910 478.5786 497.3163 516.4710 542.2938 553.0381 639.5951 649.2873 699.5124 727.6698 761.2472 781.8151 794.9482 799.9587 816.0335 834.2884 845.3947 902.5322 906.2730 938.8100 949.3020 970.4421 991.9538 1002.7087 1029.1863 1074.3805 1111.8106 1113.6232 1138.5191 1138.9308 1142.7320 1166.1850 1179.7505 1190.5512 1251.6939 1261.8928 1268.4142 1275.7620 1340.9612 1361.2370 1400.9587 1401.8368 1416.1404 1435.6313 1441.4137 1464.1465 1470.1171 1471.5285 1474.9607 1479.9334 1488.4131 1507.6807 1570.1242 1603.4506 1611.3006 1643.8956 2959.0067 2993.2103 3002.0433 3046.5008 3058.4973 3090.5597 3103.6877 3124.6385 3130.7886 3132.0896 3139.5961 3153.1396 3165.5932 3175.3827
redmass: 3.9044 2.8625 4.0285 4.1330 3.6480 3.1336 4.1972 2.6217 3.7191 5.1806 1.1971 4.8647 1.3581 4.8527 5.3926 3.5187 3.1957 5.7368 2.5771 5.2902 6.5950 3.7943 4.8116 7.1916 3.5924 6.7665 4.4138 6.1231 2.3676 4.6080 1.1023 1.5487 1.4753 4.0099 1.7310 5.1437 1.3812 4.2257 1.4962 1.3552 4.1730 2.4224 3.6926 2.2045 1.2567 1.4770 1.7267 1.4827 1.2048 1.7469 1.7217 1.1273 1.9069 2.6499 2.0441 1.9462 1.4273 1.3110 2.9913 4.3173 9.1244 1.2829 1.0404 1.0495 1.3795 1.0567 1.5957 1.0877 3.9712 7.9192 10.7537 6.1135 7.2126 1.0332 1.0358 1.0580 1.1039 1.1065 1.0987 1.1022 1.0991 1.0891 1.0897 1.0917 1.0919 1.0946 1.0953
irintensity: 1.9811 0.2983 0.6746 1.3591 3.4718 8.3794 3.3682 0.1776 0.4728 1.3640 0.3641 2.3067 0.2988 17.0775 1.9935 2.6817 0.0072 2.0796 21.3131 4.6144 0.7087 0.2495 31.6117 0.4697 0.0000 2.3779 23.3516 1.3179 5.0110 9.6345 2.4725 39.8162 2.3748 0.7561 54.6100 23.6721 9.7437 27.6351 13.1142 0.4109 71.0977 44.3452 318.3704 5.3026 0.2154 5.5725 13.3205 22.6833 61.9649 336.4506 364.6858 0.0022 252.0345 18.2805 21.0808 6.8515 1.1858 16.8763 10.9459 0.0131 0.4209 21.4068 11.9290 13.6663 142.8825 3.1039 10.5969 16.9912 93.6496 5.2591 311.2504 15.5848 164.2447 90.4330 24.3331 26.3961 47.5491 11.5646 34.9282 44.3923 27.3191 3.3771 10.3039 0.4323 5.0801 16.8352 5.3109
temp: 298.150 k
press: 1.00000 atm
elementType: 8 8 8 6 6 6 6 6 6 6 6 6 6 6 6 6 6 1 1 1 1 1 1 1 1 1 1 1 1 1 1
symmnumber: 1
zpe: 643963.2 jmol-1
zpe.correction: 0.245273 hartree
zpe.thermalcorrener: 0.261018 hartree
zpe.thermalcorrenthalpy: 0.261962 hartree
zpe.thermalcorrgfe: 0.201418 hartree
zpe.sumelectzpe: -766.344522 hartree
zpe.sumelectthermal: -766.328777 hartree
zpe.sumelectthermalent: -766.327833 hartree
zpe.sumelectthermalfe: -766.388376 hartree
dipole: -2.1738 -0.4372 -0.0001
dipole: 2.2173
quadrupole: -65.9994 -98.5907 -102.9251
quadrupole: -15.0235 0.0030 0.0004
quadrupole: 23.1723 -9.4190 -13.7533 -15.0235 0.0030 0.0004
hfenergy: -766.5897944 hartree
pointgroup: C01 [X(C14H14O3)]
dipole: -0.8571321 -0.1623182 -0.0000368 debye
polarizability: 320.1176578|-6.2730914|156.1406807|-0.0015167|0.005248|77.8221445 unknown
InChI: InChI=1S/C14H14O3/c1-3-17-14(15)12-5-4-11-9-13(16-2)7-6-10(11)8-12/h4-9H,3H2,1-2H3
charge 0 multiplicity 1
31 atoms
O  -4.890309 -0.786351 -0.000258
O  3.857201 -0.333032 -0.00043
O  3.232967 1.913648 -0.00022
C  -0.897273 0.66833 -0.000485
C  -1.191989 -0.755496 -0.000559
C  0.462845 1.101095 -0.000561
C  1.514504 0.173512 -0.000716
C  -0.091961 -1.683225 -0.00071
C  -2.549711 -1.187646 -0.000468
C  -1.990632 1.594071 -0.000323
C  1.225724 -1.236034 -0.00078
C  -3.595389 -0.252952 -0.000314
C  -3.315354 1.155753 -0.000243
C  2.908212 0.696852 -0.000793
C  5.280897 0.097062 0.000125
C  6.129044 -1.172188 0.000587
C  -6.022198 0.141695 -0.000439
H  0.703742 2.170688 -0.000503
H  -0.306971 -2.758139 -0.000766
H  -2.794592 -2.254761 -0.000524
H  -1.774133 2.668902 -0.000264
H  2.06057 -1.942092 -0.000908
H  -4.130727 1.885369 -0.000105
H  5.460229 0.724116 -0.893019
H  5.459495 0.72428 0.8933
H  7.201436 -0.903575 0.000995
H  5.922666 -1.783481 0.896112
H  5.923389 -1.783648 -0.89499
H  -6.91694 -0.498107 -0.000603
H  -6.023068 0.781055 -0.905054
H  -6.023374 0.7810 0.904216
