program: Gaussian 09
title: 000226770
version: EM64L-G09RevD.01
frameworkgroup: C1[X(C25H20O)]
method: RPBEPBE
basis: SDD
operation: Freq
keyword: #pfreq=noraman
keyword: PBEPBE/SDD
title: #p freq=noraman PBEPBE/SDD
converged: YES YES NO NO
title: Mulliken charges:
elementType: O C C C C C C C C C C C C C C C C C C C C C C C C C H H H H H H H H H H H H H H H H H H H H
charge: -0.358839 -0.014325 0.381581 0.378365 0.310825 -0.360999 -0.398050 -0.336022 -0.385010 -0.382815 -0.407092 0.337863 -0.258922 -0.256219 -0.250729 -0.253997 -0.244230 -0.220985 -0.245573 -0.244042 -0.246071 -0.356136 -0.323327 -0.204944 -0.232244 -0.245809 0.264286 0.263519 0.237771 0.260744 0.273861 0.286358 0.228493 0.226350 0.224521 0.226647 0.227130 0.224234 0.228596 0.229087 0.226110 0.246184 0.267879 0.224839 0.225086 0.226048
chargesum: 0.00000
title: Mulliken charges with hydrogens summed into heavy atoms:
elementType: O C C C C C C C C C C C C C C C C C C C C C C C C C
charge: -0.358839 -0.014325 0.381581 0.378365 0.310825 -0.096713 -0.134531 -0.098250 -0.124266 -0.108953 -0.120734 0.337863 -0.030428 -0.029869 -0.026208 -0.027350 -0.017100 0.003248 -0.016976 -0.014955 -0.019962 -0.109952 -0.055448 0.019896 -0.007158 -0.019761
polarizability: 2.80517223e+02 5.56536908e+00 2.68999550e+02 9.70020416e+00 1.03456189e+01 2.26343559e+02
1716.lowfreq: -3.5982 -0.9853 -0.0009 -0.0006 0.0004 8.0516 12.5950 25.3075 37.6733
frequency: 12.3637 24.9352 37.6334 46.8965 60.1137 69.4418 77.5263 89.8348 98.2246 162.0267 181.1961 223.0466 235.9109 256.0439 267.1071 279.0790 279.9379 324.6363 371.5784 400.6069 405.8456 411.3263 416.9912 442.6880 479.8998 494.7474 528.3192 566.0770 588.7450 611.6016 615.6715 616.8433 617.8021 627.3944 644.6373 683.1986 695.2568 702.9847 708.5064 714.9984 752.1548 758.2136 772.2305 780.1463 809.1534 837.9338 854.5160 860.2577 866.2143 882.5141 896.7521 909.1716 923.8480 937.8368 944.0033 954.8211 970.7715 981.7460 985.9790 987.8012 989.5607 990.2026 991.0737 992.5185 994.2154 999.4801 1001.0947 1002.2810 1020.5783 1027.7697 1030.5383 1031.8506 1073.4755 1080.5937 1088.2829 1090.7727 1145.9194 1163.1912 1168.7828 1170.9922 1172.4735 1173.8784 1186.2952 1187.5446 1192.9709 1198.6345 1200.5043 1227.5713 1302.4677 1311.1995 1319.1933 1328.3681 1373.3911 1376.0078 1379.7294 1380.5509 1429.8670 1434.0303 1436.7164 1438.5336 1470.1571 1477.1225 1479.7451 1482.9685 1584.8963 1589.5521 1590.3928 1590.8311 1600.1898 1607.6066 1609.7818 1611.9016 3122.2732 3123.0070 3123.7677 3124.9607 3131.2162 3131.7998 3133.9042 3135.3241 3144.3257 3145.0384 3148.0855 3152.8646 3153.7901 3157.0738 3160.1801 3165.0010 3166.2753 3167.1986 3174.0296 3183.6115
redmass: 3.8606 4.0719 4.8997 5.0550 4.7785 4.2595 4.4944 4.5828 4.0297 5.4336 5.4673 4.5477 4.7033 5.1846 4.3575 5.1265 5.1232 4.6805 5.8192 2.8454 2.8709 2.8996 2.9551 4.9601 3.6629 3.9376 3.6817 4.8006 4.9802 6.4004 6.3578 6.4041 6.3897 5.6672 5.6062 6.1507 1.9787 1.8621 1.7049 1.8038 1.9852 1.7665 1.9553 1.9592 4.7374 1.2477 1.2523 1.2484 1.3355 3.6045 3.2390 1.9342 1.9084 1.7256 1.5229 2.0623 1.3740 1.3863 1.4077 3.6550 1.5387 5.6769 4.3645 5.8666 1.4697 1.3281 1.3128 1.3132 2.0959 2.4284 2.1268 2.1120 1.5216 1.6001 1.6057 1.6157 3.0770 1.5179 1.1203 1.0581 1.0584 1.0546 1.7595 1.3014 1.1505 1.4925 1.6867 4.2263 1.3582 1.3755 1.3454 1.3272 6.2977 8.1758 8.8344 8.8862 2.2146 2.2399 2.2529 2.2560 2.2486 2.1793 2.1889 2.1742 5.8687 6.2813 6.3070 6.3807 6.2510 6.0320 5.9615 6.0288 1.0845 1.0846 1.0847 1.0848 1.0879 1.0884 1.0884 1.0896 1.0929 1.0935 1.0926 1.0951 1.0943 1.0953 1.0995 1.1007 1.0971 1.1001 1.0980 1.0943
irintensity: 0.1274 0.1445 0.5078 0.0041 0.1188 0.1165 0.4587 0.6487 0.1524 1.1231 0.7502 0.5695 0.2377 0.7255 0.3806 0.1133 0.0701 0.2068 8.8228 0.3748 0.0567 0.2789 0.0590 6.5666 3.1085 6.4286 0.4394 6.6721 8.7208 2.2603 0.3874 0.5760 0.0525 25.5861 14.6767 3.0620 36.1411 39.5023 78.6712 46.8049 41.1929 40.9912 24.3136 78.6710 27.9392 0.6271 0.6056 0.7815 5.9910 91.2987 14.3170 20.7026 17.7557 1.9979 6.7850 3.7629 0.5331 0.1523 0.9497 0.2091 0.2700 0.3754 1.3527 0.9325 1.3218 0.1525 0.1253 1.3515 18.1750 1.3132 9.3096 10.2890 8.0950 2.4258 7.9953 8.8072 37.6677 32.7776 7.4017 1.2216 0.2317 0.4274 54.0151 20.8557 4.9907 1.2959 11.2209 58.1235 0.9685 2.0787 3.8610 0.4680 0.2034 0.4270 0.2356 0.3621 6.4084 16.9321 5.7779 12.0037 95.4277 24.4656 11.5154 20.2077 0.0549 6.4283 2.9745 1.4361 45.0026 7.9477 4.0204 0.4885 1.1941 1.4867 0.1113 1.1216 1.8969 12.0786 6.2397 13.7775 31.8266 37.4140 17.4269 29.1140 26.2983 25.4712 30.2327 17.1671 22.3532 10.2559 6.0744 6.4754
temp: 298.150 k
press: 1.00000 atm
elementType: 8 6 6 6 6 6 6 6 6 6 6 6 6 6 6 6 6 6 6 6 6 6 6 6 6 6 1 1 1 1 1 1 1 1 1 1 1 1 1 1 1 1 1 1 1 1
symmnumber: 1
zpe: 965863.2 jmol-1
zpe.correction: 0.367878 hartree
zpe.thermalcorrener: 0.388947 hartree
zpe.thermalcorrenthalpy: 0.389892 hartree
zpe.thermalcorrgfe: 0.315580 hartree
zpe.sumelectzpe: -1038.089453 hartree
zpe.sumelectthermal: -1038.068383 hartree
zpe.sumelectthermalent: -1038.067439 hartree
zpe.sumelectthermalfe: -1038.141751 hartree
dipole: 0.4755 -0.0147 1.4295
dipole: 1.5066
quadrupole: -140.7684 -137.5628 -145.0820
quadrupole: 0.6334 1.6303 2.3055
quadrupole: 0.3693 3.5750 -3.9443 0.6334 1.6303 2.3055
hfenergy: -1038.4573308 hartree
pointgroup: C01 [X(C25H20O1)]
dipole: -0.1577279 -0.2717796 0.5025762 debye
polarizability: 276.480039|10.1984344|274.187644|-5.3688112|8.625706|225.1926488 unknown
InChI: InChI=1S/C25H20O/c1-5-13-21(14-6-1)25(22-15-7-2-8-16-22,23-17-9-3-10-18-23)26-24-19-11-4-12-20-24/h1-20H
charge 0 multiplicity 1
46 atoms
O  -0.469585 0.510094 -1.237023
C  0.399408 0.234325 -0.019289
C  -0.464948 0.429721 1.23891
C  1.053619 -1.161688 -0.1598
C  1.532991 1.283993 -0.128211
C  -1.274935 -0.623272 1.741319
C  1.448016 -1.927609 0.965771
C  2.556224 1.304687 0.854345
C  -0.573073 1.708857 1.841793
C  1.395938 -1.630939 -1.453818
C  1.587445 2.214089 -1.192391
C  -1.781829 -0.024409 -1.320835
C  -2.149667 -0.407975 2.827587
C  2.148506 -3.144384 0.800237
C  3.609873 2.238826 0.776603
C  -1.446089 1.926393 2.92935
C  2.095286 -2.844074 -1.620942
C  2.647495 3.147656 -1.273373
C  -2.23703 0.867171 3.430481
C  2.473887 -3.610222 -0.492894
C  3.662224 3.166157 -0.291279
C  -2.854037 0.896069 -1.261504
C  -2.028262 -1.396275 -1.570891
C  -4.178582 0.444486 -1.451592
C  -3.358169 -1.838932 -1.751641
C  -4.436401 -0.925335 -1.693665
H  -1.230991 -1.613941 1.278633
H  1.207733 -1.579788 1.976105
H  2.530288 0.588948 1.683415
H  0.030952 2.537578 1.458441
H  1.110314 -1.030936 -2.324268
H  0.797914 2.19968 -1.946829
H  -2.766904 -1.234408 3.197112
H  2.440183 -3.724952 1.682871
H  4.390572 2.241126 1.545678
H  -1.509741 2.92171 3.383437
H  2.349344 -3.189599 -2.629466
H  2.676453 3.860864 -2.1052
H  -2.914182 1.034469 4.275736
H  3.018054 -4.552618 -0.621106
H  4.482887 3.889587 -0.355323
H  -2.631856 1.950114 -1.066778
H  -1.195336 -2.101687 -1.633136
H  -5.007078 1.160362 -1.40622
H  -3.549107 -2.900305 -1.947938
H  -5.464101 -1.275713 -1.839712
