program: Gaussian 09
title: 000226767
version: EM64L-G09RevD.01
frameworkgroup: C1[X(C16H12O2)]
method: RPBEPBE
basis: SDD
operation: Freq
keyword: #pfreq=noraman
keyword: PBEPBE/SDD
title: #p freq=noraman PBEPBE/SDD
converged: YES YES NO NO
title: Mulliken charges:
elementType: O O C C C C C C C C C C C C C C C C H H H H H H H H H H H H
charge: -0.295599 -0.265566 0.241722 0.176457 0.263542 0.494524 0.063631 -0.661537 -0.398458 -0.353778 -0.385012 -0.455685 -0.263902 -0.255936 -0.250408 -0.248910 0.162324 -0.498877 0.283205 0.224315 0.226461 0.307900 0.251396 0.229040 0.230746 0.230489 0.233598 0.230608 0.242209 0.241503
chargesum: 0.00000
title: Mulliken charges with hydrogens summed into heavy atoms:
elementType: O O C C C C C C C C C C C C C C C C
charge: -0.295599 -0.265566 0.241722 0.176457 0.263542 0.494524 0.063631 -0.378332 -0.174143 -0.127317 -0.077112 -0.204289 -0.034862 -0.025189 -0.019920 -0.015312 0.162324 0.215443
polarizability: 2.61050145e+02 2.49934669e+01 2.46111283e+02 -4.12072308e-01 2.01705975e-01 7.26634386e+01
1716.lowfreq: -6.0464 -4.9864 -0.0006 -0.0006 0.0002 5.2188 22.9843 62.6629 97.3347
frequency: 22.9689 62.6562 97.3323 101.8189 114.9926 136.2825 161.2599 238.5122 243.1509 285.1204 289.4466 313.5015 372.6463 403.8628 411.5033 433.0650 463.8001 507.6459 548.2989 581.5816 593.9353 601.4378 616.6327 705.7878 711.0617 714.7105 746.1241 765.7118 775.9804 785.7047 819.7233 861.5985 880.3270 882.5647 901.3116 949.9299 971.2065 977.9446 991.7212 994.9404 998.4343 1010.6719 1040.5542 1052.5383 1097.4731 1114.3168 1128.7273 1145.2249 1161.4088 1178.8149 1186.9944 1218.6005 1258.7650 1265.0533 1295.0935 1313.6591 1376.4582 1394.1863 1408.0094 1423.0840 1435.2581 1444.5725 1450.3751 1450.6905 1464.9156 1495.5384 1530.4889 1577.7891 1590.4810 1614.7994 1620.0086 1624.1168 3002.3514 3103.0674 3125.6185 3129.6334 3135.7033 3144.7338 3146.9240 3155.5022 3164.1730 3165.9984 3170.9358 3187.5548
redmass: 6.2872 3.9915 3.7928 1.8114 1.7033 4.0644 3.9315 4.8115 3.9878 4.9955 5.4873 5.4109 8.0490 6.6542 3.3935 3.1799 5.5738 3.1667 3.3217 6.3042 7.0525 3.5115 6.7896 5.7033 5.9919 4.7637 1.9374 1.4559 5.5792 1.9833 1.8098 6.1902 1.4704 5.8475 1.8255 1.5624 1.4514 1.4854 7.4889 1.3890 8.2010 1.3235 2.0972 2.2627 2.7789 1.2613 2.4756 1.4218 1.7519 1.0722 1.1394 1.4571 2.3410 1.7911 1.7403 2.5658 3.7397 3.3443 4.1328 1.2489 2.3039 2.7642 3.0263 1.0562 1.0541 3.1593 3.8120 7.4569 7.0286 6.8936 6.9323 6.5072 1.0295 1.1043 1.0864 1.0858 1.0893 1.1046 1.0917 1.0945 1.0985 1.0917 1.0965 1.0951
irintensity: 1.4658 0.1125 0.3304 3.1190 0.6797 1.2464 2.8692 0.2309 1.3489 5.9433 9.7360 6.5886 7.4556 1.9069 0.3556 9.4204 0.8437 5.6846 1.9313 2.4369 3.2262 1.0719 6.8797 0.2448 0.8433 0.9030 76.4322 19.5129 2.8155 83.0102 0.0624 3.2295 0.3355 16.6548 4.4095 4.4774 1.5171 17.1383 4.3525 1.0598 96.6687 1.5839 6.1999 3.9314 37.4027 0.2726 255.3824 32.0097 82.0406 0.6087 4.2347 95.0415 0.1890 73.5354 23.3133 1.8252 5.9214 1.4616 0.7139 22.1441 30.6420 16.6220 18.3182 13.6096 12.1799 15.7912 16.7949 8.7960 36.9886 138.3781 69.4809 7.0898 48.5790 27.3179 2.4396 2.6037 10.4024 15.4364 25.3737 4.3900 32.3144 2.0423 36.2335 20.0139
temp: 298.150 k
press: 1.00000 atm
elementType: 8 8 6 6 6 6 6 6 6 6 6 6 6 6 6 6 6 6 1 1 1 1 1 1 1 1 1 1 1 1
symmnumber: 1
zpe: 610317.4 jmol-1
zpe.correction: 0.232458 hartree
zpe.thermalcorrener: 0.246875 hartree
zpe.thermalcorrenthalpy: 0.247819 hartree
zpe.thermalcorrgfe: 0.190126 hartree
zpe.sumelectzpe: -766.146647 hartree
zpe.sumelectthermal: -766.132229 hartree
zpe.sumelectthermalent: -766.131285 hartree
zpe.sumelectthermalfe: -766.188978 hartree
dipole: -1.4382 -1.6345 0.0654
dipole: 2.1782
quadrupole: -88.0969 -88.6122 -109.6115
quadrupole: -7.7483 0.2497 0.1825
quadrupole: 7.3433 6.8280 -14.1713 -7.7483 0.2497 0.1825
hfenergy: -766.3791044 hartree
pointgroup: C01 [X(C16H12O2)]
dipole: -0.6761819 0.5215463 -0.0718198 debye
polarizability: 269.6738017|-20.6119801|235.8059654|0.0728915|-16.467544|74.3450985 unknown
InChI: InChI=1S/C16H12O2/c1-18-16(17)15-10-11-6-2-3-7-12(11)13-8-4-5-9-14(13)15/h2-10H,1H3
charge 0 multiplicity 1
30 atoms
O  2.712415 2.231716 -0.3935
O  3.613499 0.118806 -0.105629
C  -0.644211 -1.323006 0.046163
C  -1.65811 -0.268386 -0.048871
C  0.765365 -0.990676 0.002668
C  -1.226812 1.098563 -0.18807
C  1.156527 0.415852 -0.142936
C  0.175314 1.399977 -0.231905
C  -1.018646 -2.695427 0.182704
C  -3.064097 -0.521199 -0.01083
C  1.724116 -2.05096 0.100103
C  -2.190959 2.151637 -0.283653
C  -0.062149 -3.7126 0.275663
C  1.319997 -3.384775 0.234311
C  -3.995016 0.523003 -0.105958
C  -3.560399 1.873369 -0.244037
C  2.588696 0.842952 -0.202585
C  4.101569 2.733987 -0.465711
H  0.484057 2.44331 -0.340221
H  -2.077029 -2.96884 0.216258
H  -3.437374 -1.543714 0.094423
H  2.78496 -1.797545 0.068664
H  -1.834845 3.183056 -0.389282
H  -0.379241 -4.755981 0.379937
H  2.073947 -4.17622 0.307371
H  -5.066992 0.29888 -0.073539
H  -4.295656 2.681423 -0.317989
H  3.998836 3.815244 -0.635339
H  4.643106 2.25009 -1.296023
H  4.63463 2.528362 0.478012
