program: Gaussian 09
title: 000226759
version: EM64L-G09RevD.01
frameworkgroup: C1[X(C22H22O5)]
method: RPBEPBE
basis: SDD
operation: Freq
keyword: #pfreq=noraman
keyword: PBEPBE/SDD
title: #p freq=noraman PBEPBE/SDD
converged: YES YES NO NO
title: Mulliken charges:
elementType: O O O O O C C C C C C C C C C C C C C C C C C C C C C H H H H H H H H H H H H H H H H H H H H H H
charge: -0.265183 -0.267533 -0.194986 -0.242672 -0.215949 0.067263 -0.340028 -0.372623 0.431364 0.056141 0.223673 0.183160 -0.415566 -0.400859 0.302684 -0.231201 -0.234851 -0.344422 -0.350183 -0.224269 -0.220099 -0.240839 -0.254712 -0.238735 -0.673451 -0.674746 -0.225046 0.337436 0.327992 0.237286 0.245778 0.226426 0.225970 0.276413 0.277608 0.235293 0.230651 0.234787 0.229831 0.228247 0.233436 0.233433 0.229667 0.232473 0.213214 0.226860 0.234975 0.212786 0.233105
chargesum: 0.00000
title: Mulliken charges with hydrogens summed into heavy atoms:
elementType: O O O O O C C C C C C C C C C C C C C C C C C C C C C
charge: -0.265183 -0.267533 -0.194986 -0.242672 -0.215949 0.067263 -0.002593 -0.044631 0.431364 0.056141 0.223673 0.183160 -0.178280 -0.155081 0.302684 -0.004775 -0.008882 -0.068009 -0.072575 0.241675 0.244519 -0.012592 -0.021277 -0.005301 0.001904 -0.000124 0.008060
polarizability: 3.13813601e+02 -1.96024216e+00 2.25472460e+02 9.36714220e+00 4.58267588e-01 2.05563946e+02
1716.lowfreq: -18.0641 -15.6390 -3.4272 0.0003 0.0006 0.0008 5.7371 6.9167 16.6858
frequency: -17.6157 -14.6515 16.4904 26.7625 39.5940 44.1768 49.8241 53.8829 56.5078 67.7262 78.0282 88.7046 105.8929 127.5470 144.4682 158.0028 178.1815 187.1830 203.0909 214.9182 236.9956 249.2895 263.2557 273.5271 291.0581 348.8696 358.1960 393.9004 400.9228 402.1122 406.3716 440.1136 447.2950 461.1838 508.0590 524.2737 579.2432 613.1289 616.3510 639.7605 661.8551 684.8889 698.9907 702.3547 717.8315 748.0332 754.0470 771.0034 795.6975 799.3403 799.8387 806.2952 820.0860 821.5560 854.3377 864.0355 866.3217 878.1492 925.3267 952.5701 973.5700 976.5452 979.4992 989.1424 992.0783 995.4776 996.8788 1009.7058 1011.2414 1024.1841 1024.9405 1029.3585 1046.2940 1068.7114 1076.8459 1085.7805 1093.5446 1113.4315 1113.8463 1134.9009 1135.8134 1149.1513 1172.6677 1173.1367 1188.4119 1192.0664 1204.6028 1216.7862 1250.2791 1251.5013 1254.7607 1278.3992 1311.2824 1323.7064 1332.1538 1357.4414 1361.5649 1378.8789 1388.0512 1399.9865 1401.9527 1428.0030 1436.5312 1440.4492 1462.8819 1463.9746 1472.4418 1472.8784 1482.3997 1485.5043 1486.2008 1492.6451 1563.7143 1590.1771 1594.9088 1610.9831 1614.7283 1617.0053 1636.9771 2995.6619 2997.1195 3012.0109 3013.5959 3071.4190 3073.5847 3085.2031 3092.3691 3094.0218 3107.6990 3109.4843 3113.0024 3122.1084 3127.5118 3128.3847 3138.0228 3138.8916 3147.7230 3148.5365 3157.3419 3164.2293 3168.3770
redmass: 4.7029 4.4973 4.0878 3.5392 4.4946 3.8329 4.3693 2.9981 4.3161 2.6483 7.0766 5.9048 4.6949 3.0747 4.3739 3.1548 3.8726 5.6203 3.5144 5.2025 2.1633 1.5912 1.9599 4.2952 6.1492 4.4276 3.8316 4.5987 3.8117 2.8333 3.7989 6.1597 4.2865 4.8485 4.8976 4.1874 4.9080 6.4345 6.3953 6.4437 6.5699 5.3655 1.9298 1.9202 3.9750 2.3185 6.2207 2.3704 4.3934 1.1539 1.1318 3.2215 3.7607 3.9375 1.2659 1.3332 3.4238 5.3152 1.5201 1.4550 2.6002 4.8595 1.4665 6.0158 5.8829 1.3897 1.3431 1.3846 2.5347 2.4473 2.2806 2.1180 3.0234 1.3306 2.2054 1.6341 1.7995 2.2232 2.2582 1.4675 1.4628 4.3180 1.0534 1.0712 1.1260 1.1575 2.0115 3.1361 1.1865 1.1959 2.7091 1.8391 1.5782 1.3421 1.4842 1.3904 1.4754 7.2418 9.0727 1.2695 1.2711 2.5336 2.2525 2.4069 1.0400 1.0398 1.0625 1.0625 2.2189 1.0682 1.0673 2.6766 8.1936 6.1249 6.7158 6.2525 11.2329 6.2917 11.7445 1.0357 1.0359 1.0581 1.0582 1.1065 1.1065 1.0870 1.0985 1.0986 1.1029 1.1029 1.0866 1.0848 1.0875 1.0852 1.0883 1.0923 1.0926 1.0966 1.0964 1.1016 1.1015
irintensity: 0.7439 0.6346 0.3799 0.4783 0.5779 0.2006 1.5460 0.1359 0.6172 0.6022 1.1043 0.5301 1.8192 4.1153 0.1775 0.1490 1.2193 3.6075 5.5317 0.9386 1.3979 0.6242 6.6174 15.8026 2.8695 9.8180 5.0832 3.0491 0.2110 0.0435 1.8670 0.3521 3.9011 12.3256 29.8250 0.8976 13.3841 0.0726 0.2060 10.0876 6.2051 1.5249 47.1372 47.5233 19.1226 41.2781 1.1685 41.4376 1.3444 4.8106 3.8877 6.5038 32.1283 9.1601 0.0951 1.7716 5.5508 12.1750 2.8127 3.8295 2.7918 9.1940 1.8978 2.6223 0.2488 0.1550 0.0591 1.2508 42.2635 72.3750 13.6766 12.4885 49.3313 7.8490 91.5912 24.4995 57.7748 6.1871 3.3396 1.9388 5.9599 398.1016 0.3422 3.3643 3.7776 53.5007 34.3852 159.1890 20.9039 27.5817 280.5194 123.6882 7.1950 3.4980 11.4241 0.9070 2.0516 0.1348 3.4068 22.2478 23.2153 38.0857 5.5194 83.6701 11.5271 10.7151 3.6415 2.4437 7.3954 19.1073 4.6059 3.9492 86.0083 0.7139 13.1593 29.9494 214.7971 21.9209 87.7185 19.0434 19.8276 17.7886 15.3928 5.1868 4.7616 5.2203 28.7796 27.3874 41.2826 37.6181 6.4223 3.3368 0.2024 0.1021 6.1902 20.0844 10.6921 35.0983 14.2928 24.1206 29.3395
temp: 298.150 k
press: 1.00000 atm
elementType: 8 8 8 8 8 6 6 6 6 6 6 6 6 6 6 6 6 6 6 6 6 6 6 6 6 6 6 1 1 1 1 1 1 1 1 1 1 1 1 1 1 1 1 1 1 1 1 1 1
symmnumber: 1
zpe: 1012248.4 jmol-1
zpe.correction: 0.385545 hartree
zpe.thermalcorrener: 0.410441 hartree
zpe.thermalcorrenthalpy: 0.411385 hartree
zpe.thermalcorrgfe: 0.327932 hartree
zpe.sumelectzpe: -1225.692711 hartree
zpe.sumelectthermal: -1225.667815 hartree
zpe.sumelectthermalent: -1225.666871 hartree
zpe.sumelectthermalfe: -1225.750324 hartree
dipole: 0.4951 3.4268 3.4635
dipole: 4.8973
quadrupole: -127.2055 -141.8464 -168.4378
quadrupole: -0.8683 1.5110 -3.5588
quadrupole: 18.6244 3.9835 -22.6079 -0.8683 1.5110 -3.5588
hfenergy: -1226.078256 hartree
pointgroup: C01 [X(C22H22O5)]
dipole: -0.2311174 -1.4037615 1.2993838 debye
polarizability: 313.5604384|-4.1489659|225.6411893|-9.8987687|0.7694911|205.6483786 unknown
InChI: InChI=1S/C22H22O5/c1-3-26-20(24)22(21(25)27-4-2)17(15-11-7-5-8-12-15)18(22)19(23)16-13-9-6-10-14-16/h5-14,17-18H,3-4H2,1-2H3
charge 0 multiplicity 1
49 atoms
O  1.651507 -2.180052 0.419441
O  -1.150567 -2.120713 -0.718475
O  -1.513387 2.025685 -1.868534
O  0.947022 -0.617384 1.99777
O  -0.259089 -1.113867 -2.624498
C  0.379864 -0.332758 -0.377675
C  1.074513 0.945511 -0.928747
C  -0.168934 1.102409 -0.081314
C  2.439243 1.362815 -0.457411
C  -1.474366 1.561464 -0.690456
C  0.986735 -1.029485 0.813957
C  -0.336341 -1.205064 -1.379949
C  2.621118 2.492973 0.37607
C  3.578756 0.637556 -0.893182
C  -2.7110 1.443408 0.149002
C  3.918041 2.892032 0.771162
C  4.874469 1.034538 -0.499195
C  -2.714718 0.765761 1.399378
C  -3.91872 2.010662 -0.341306
C  2.309487 -2.967358 1.511543
C  -1.928391 -3.057353 -1.590705
C  5.048506 2.164131 0.335321
C  -3.909273 0.664195 2.144063
C  -5.108054 1.910808 0.405544
C  2.966212 -4.172116 0.847939
C  -2.755461 -3.936746 -0.65985
C  -5.105444 1.237179 1.652138
H  0.891732 1.050511 -2.008205
H  -0.022055 1.359238 0.975078
H  1.747443 3.064538 0.709551
H  3.44377 -0.235858 -1.542208
H  4.046067 3.769384 1.414962
H  5.747185 0.467699 -0.842879
H  -1.798708 0.307238 1.78747
H  -3.893657 2.520575 -1.310289
H  3.036911 -2.307179 2.016472
H  1.531663 -3.25293 2.242503
H  -2.552327 -2.452482 -2.272699
H  -1.208962 -3.635128 -2.198719
H  6.054331 2.473962 0.640448
H  -3.908874 0.13911 3.105362
H  -6.03429 2.354212 0.024186
H  2.216436 -4.79769 0.334316
H  3.718851 -3.852121 0.107433
H  3.471209 -4.789996 1.612614
H  -2.10525 -4.515778 0.01802
H  -3.440495 -3.32493 -0.048425
H  -3.359015 -4.646419 -1.25461
H  -6.030094 1.159513 2.235288
