program: Gaussian 09
title: 000226731
version: EM64L-G09RevD.01
frameworkgroup: C1[X(C11H15NO4)]
method: RPBEPBE
basis: SDD
operation: Freq
keyword: #p
keyword: freq=noraman
keyword: PBEPBE/SDD
title: #p freq=noraman PBEPBE/SDD
converged: YES YES NO NO
title: Mulliken charges:
elementType: O O O O N C C C C C C C C C C C H H H H H H H H H H H H H H H
charge: -0.323188 -0.294140 -0.247304 -0.259082 -0.365817 0.195840 0.069893 0.107691 -0.305465 -0.786308 0.189164 0.165668 -0.209565 -0.216494 -0.676989 -0.676280 0.346065 0.284961 0.264760 0.242501 0.242559 0.230448 0.229846 0.226882 0.227031 0.216369 0.226882 0.227075 0.211860 0.227569 0.227565
chargesum: 0.00000
title: Mulliken charges with hydrogens summed into heavy atoms:
elementType: O O O O N C C C C C C C C C C C
charge: -0.323188 -0.294140 -0.247304 -0.259082 -0.019752 0.195840 0.069893 0.107691 -0.020504 -0.036487 0.189164 0.165668 0.250729 0.237420 -0.006662 -0.009286
polarizability: 2.27192350e+02 5.15182308e-01 1.44892638e+02 6.04981329e-02 7.71341729e-02 8.07151039e+01
1716.lowfreq: -2.6715 -0.0008 0.0004 0.0005 6.0094 10.3119 34.3032 37.8653 57.4033
frequency: 34.2864 37.8178 57.2259 62.2319 73.1381 86.1471 104.2301 108.0018 114.9089 145.3626 194.7983 232.3632 237.4422 247.1983 265.9236 275.4679 283.9060 291.3568 353.3318 364.6566 450.4112 486.6807 551.1694 601.3056 623.1402 674.7591 698.6486 726.0036 746.3417 769.4852 778.4332 799.8028 800.0772 825.8768 843.1642 845.8062 917.2963 1006.2145 1013.1852 1035.1624 1045.1047 1046.6099 1110.3324 1111.7319 1116.5486 1136.2471 1137.4797 1165.1196 1219.7750 1243.9325 1248.1987 1248.9939 1322.4192 1357.8036 1366.9751 1399.5422 1400.8619 1403.4583 1412.1765 1442.5894 1457.2991 1463.4180 1464.0284 1470.6654 1474.9543 1476.0930 1486.5506 1488.1309 1504.2949 1560.0337 1629.0811 1643.9479 2994.3406 2994.4301 2994.5050 3007.8808 3010.6467 3064.9070 3067.3184 3067.6557 3090.7001 3091.4338 3104.6463 3105.1279 3119.9904 3250.8765 3590.2696
redmass: 3.6122 3.2024 2.1697 3.9611 4.2275 2.1433 1.4508 2.7780 4.0367 2.7616 5.3883 3.2380 1.3809 1.2747 5.1855 3.6053 3.4871 5.0462 4.4837 3.3094 5.7681 7.2031 3.9288 4.8125 5.0525 5.5102 1.3071 4.9262 4.8604 7.6745 6.5471 1.0993 1.1013 3.5856 1.4989 3.8763 3.3394 2.2548 2.2474 3.1525 1.5085 4.3251 2.0108 2.1962 1.8391 1.4662 1.4683 2.4259 3.5469 2.3896 1.1332 1.1308 3.0318 1.4295 1.7111 1.3358 1.2760 1.3519 2.4304 4.6861 1.1924 1.0407 1.0409 1.0452 1.0611 1.0564 1.1189 1.0753 4.7291 5.5928 10.6459 10.7446 1.0372 1.0360 1.0358 1.0582 1.0582 1.1064 1.0963 1.1059 1.0985 1.0985 1.1029 1.1025 1.1004 1.0994 1.0816
irintensity: 0.0336 0.0146 0.5774 0.4675 0.0340 1.8836 0.5068 0.0657 0.4487 12.1622 3.6794 5.8073 0.0015 4.0948 3.3040 0.7349 2.4264 8.8546 1.6617 19.5053 3.6390 1.0510 1.8273 8.0530 0.5748 0.9914 119.2574 6.8113 8.5192 11.0699 1.0093 2.6993 4.0731 4.2925 6.8568 7.1532 215.4309 130.7544 65.8011 519.6663 3.7099 89.0673 5.4961 0.3760 8.0288 5.3981 5.3218 163.2596 38.1300 425.4959 0.0073 0.0026 98.0454 4.5926 17.5404 61.0221 22.5962 38.0690 152.7192 5.8647 8.4083 11.5823 12.6150 14.5086 6.5227 5.9683 12.4656 11.8263 15.7959 38.1680 357.5608 292.4450 16.4600 24.5710 15.9043 24.4036 22.4303 7.7929 7.9634 10.2739 35.1999 31.3183 44.2241 52.5968 3.9157 2.7310 113.8123
temp: 298.150 k
press: 1.00000 atm
elementType: 8 8 8 8 7 6 6 6 6 6 6 6 6 6 6 6 1 1 1 1 1 1 1 1 1 1 1 1 1 1 1
symmnumber: 1
zpe: 648207.8 jmol-1
zpe.correction: 0.246889 hartree
zpe.thermalcorrener: 0.264488 hartree
zpe.thermalcorrenthalpy: 0.265432 hartree
zpe.thermalcorrgfe: 0.199676 hartree
zpe.sumelectzpe: -782.629746 hartree
zpe.sumelectthermal: -782.612147 hartree
zpe.sumelectthermalent: -782.611203 hartree
zpe.sumelectthermalfe: -782.676960 hartree
dipole: -0.8554 -5.0806 -0.0063
dipole: 5.1521
quadrupole: -74.4188 -96.3021 -94.3487
quadrupole: 2.3885 0.0029 0.0035
quadrupole: 13.9378 -7.9456 -5.9922 2.3885 0.0029 0.0035
hfenergy: -782.8766354 hartree
pointgroup: C01 [X(C11H15N1O4)]
dipole: -0.3332692 1.9994043 0.0047559 debye
polarizability: 227.187669|-0.6479946|144.8944358|-0.642884|0.1098728|80.7179869 unknown
InChI: InChI=1S/C11H15NO4/c1-4-15-10(13)8-6-12-9(7(8)3)11(14)16-5-2/h6,12H,4-5H2,1-3H3
charge 0 multiplicity 1
31 atoms
O  -3.361993 0.613815 0.019753
O  3.370677 0.641556 -0.010273
O  -3.080281 -1.71723 0.012838
O  2.999862 -1.66725 -0.015265
N  -0.747885 1.131547 0.008718
C  -0.002461 -1.028596 0.000319
C  -1.159035 -0.217314 0.007402
C  1.122264 -0.119722 -0.002856
C  0.620257 1.202555 0.001946
C  0.043865 -2.531302 -0.00301
C  -2.575233 -0.566424 0.013394
C  2.539874 -0.495645 -0.010392
C  -4.838501 0.403081 0.025907
C  4.836964 0.365438 -0.017674
C  -5.486579 1.783887 0.012136
C  5.540446 1.719093 -0.022221
H  -1.415338 1.902851 0.013919
H  1.168151 2.140955 0.001422
H  -0.972471 -2.953228 0.002627
H  0.592252 -2.902039 -0.887654
H  0.603761 -2.905537 0.872855
H  -5.107711 -0.199479 -0.86038
H  -5.102518 -0.17842 0.92782
H  5.08453 -0.236783 0.875517
H  5.075432 -0.238376 -0.91222
H  -6.586777 1.67889 0.0176
H  -5.192032 2.369109 0.900399
H  -5.198754 2.347907 -0.891883
H  6.635963 1.571777 -0.026915
H  5.265606 2.303727 -0.917023
H  5.273564 2.305558 0.873795
