program: Gaussian 09
title: 000226716
version: EM64L-G09RevD.01
frameworkgroup: C1[X(C19H28O)]
method: RPBEPBE
basis: SDD
operation: Freq
keyword: #pfreq=noraman
keyword: PBEPBE/SDD
title: #p freq=noraman PBEPBE/SDD
converged: YES YES NO NO
title: Mulliken charges:
elementType: O C C C C C C C C C C C C C C C C C C C H H H H H H H H H H H H H H H H H H H H H H H H H H H H
charge: -0.235391 0.173099 0.165228 -0.492463 -0.493054 0.344117 0.350646 -0.745440 -0.740272 -0.743701 -0.742850 -0.653441 -0.591588 0.382154 0.173970 -0.533472 0.079404 -0.695624 -0.484631 -0.693020 0.202790 0.209459 0.202810 0.209146 0.226370 0.226964 0.214665 0.212378 0.214763 0.223870 0.219457 0.227286 0.214599 0.207334 0.215972 0.224928 0.232852 0.238771 0.201467 0.245858 0.253986 0.214795 0.207568 0.234934 0.225621 0.226844 0.207050 0.233789
chargesum: 0.00000
title: Mulliken charges with hydrogens summed into heavy atoms:
elementType: O C C C C C C C C C C C C C C C C C C C
charge: -0.235391 0.173099 0.165228 -0.080213 -0.081098 0.344117 0.350646 -0.077440 -0.089261 -0.082359 -0.094615 -0.420589 -0.352817 0.382154 0.173970 -0.086147 0.079404 -0.019275 -0.024075 -0.025338
polarizability: 2.66284870e+02 -6.75481890e-01 2.24036015e+02 -8.22178671e-01 -2.35214744e+00 1.45684124e+02
1716.lowfreq: -7.7063 0.0003 0.0007 0.0007 5.7833 8.2141 24.1215 36.7543 45.9101
frequency: 23.9758 36.6916 45.8450 71.5223 87.9925 104.9041 116.1278 133.1601 171.7762 191.6468 199.3907 207.2153 213.3945 215.8537 234.5846 249.7672 251.1185 262.8495 267.9929 286.4467 301.7709 323.5871 326.1176 343.0249 357.7199 372.3462 398.7447 430.7987 452.8390 458.6260 490.8410 513.8683 530.3146 535.4129 568.9204 618.8602 653.2428 684.0527 702.1865 733.0696 765.6913 773.7048 785.6015 814.3095 837.0438 885.0018 891.7940 910.3424 915.7832 927.2033 929.2079 933.4938 952.4992 966.3714 968.2026 1002.6287 1006.7237 1022.1691 1028.9270 1059.4292 1059.8339 1064.9423 1068.0324 1083.3259 1089.7211 1118.4951 1172.3194 1182.2806 1197.6882 1205.7965 1216.6022 1229.2613 1235.1307 1248.7979 1251.3013 1263.8944 1295.7886 1299.6514 1311.2332 1329.9024 1343.8310 1345.5112 1363.0160 1370.9617 1373.6561 1376.0146 1381.9735 1394.0983 1394.7147 1398.2581 1439.4480 1453.5573 1460.5366 1462.1832 1464.4202 1466.8811 1467.3690 1471.1192 1472.8662 1477.0724 1477.3356 1478.6262 1482.4393 1486.5901 1487.9047 1491.7551 1498.0639 1533.7701 1583.0999 1611.1435 2966.5594 2970.8485 2972.0734 2973.4261 2974.1659 2976.6096 2980.5558 2981.9220 2989.1892 2995.8710 3018.8397 3025.4745 3035.6685 3063.2963 3064.9509 3065.5061 3068.7585 3071.0078 3074.6280 3076.4221 3078.4766 3080.1356 3081.3527 3090.4385 3100.3130 3101.8106 3120.6482 3152.0646
redmass: 3.7962 3.8652 2.7835 2.5380 2.0143 3.1577 3.6259 2.6803 2.3332 1.3037 1.3337 1.4298 1.6410 1.2924 1.7739 1.4940 1.2447 1.7722 2.1918 2.4845 2.6173 2.6378 3.5365 2.4982 2.4826 3.0271 3.2191 2.4574 3.3083 2.9482 2.9834 3.0372 2.9346 3.1809 3.0461 2.8545 4.0204 5.4618 4.1615 4.0292 2.4691 2.8495 1.1941 1.5151 2.1368 2.0455 3.5102 1.5884 1.5026 1.4912 1.5279 1.7162 2.2209 1.5095 2.1830 1.2699 1.7544 1.4557 2.3313 1.7856 1.8143 1.7119 1.6148 1.6418 2.8070 1.9860 2.6648 3.2973 1.7427 2.7752 3.0646 2.9211 1.9560 1.2765 1.3179 1.7975 1.3452 2.0105 1.4415 1.8773 1.4503 1.4872 5.1232 2.6436 1.1917 1.1914 1.4889 1.2094 1.2339 1.2702 1.1140 1.0672 1.0630 1.0874 1.0517 1.0398 1.0647 1.0738 1.0868 1.0669 1.0521 1.2240 1.0539 1.0652 1.0688 1.0751 1.8947 7.4679 8.1904 6.2711 1.0610 1.0358 1.0368 1.0433 1.0416 1.0468 1.0371 1.0572 1.0639 1.0366 1.0973 1.0993 1.1026 1.0995 1.0973 1.0995 1.0988 1.0987 1.1000 1.1001 1.0991 1.0992 1.0972 1.1001 1.1006 1.0997 1.0890 1.0884
irintensity: 1.7262 1.4041 0.0220 0.0551 1.7470 0.4380 0.2824 0.0784 0.5716 0.3953 0.1458 0.0222 0.0532 0.1239 0.1583 0.4236 0.0614 0.4531 0.2026 0.1591 0.5640 0.8972 3.5782 2.6914 3.0266 3.1285 2.7490 1.3957 0.8103 0.0005 0.5850 1.2756 0.8982 4.5340 0.4428 1.7922 3.6934 1.9203 1.7716 0.9456 4.3901 1.7968 7.7182 14.5784 7.3955 3.1933 9.9193 3.9865 10.0613 2.3376 0.4677 4.2074 11.9970 0.1088 8.9437 1.6839 10.0808 3.9493 44.6327 7.4229 26.1349 7.1650 1.1396 4.9739 7.4968 26.6242 12.6592 2.5236 8.5200 14.0037 36.1865 2.7314 86.0040 8.3836 6.2384 19.5676 9.2820 7.8644 0.4802 47.4648 4.3179 1.1956 0.9749 5.5156 3.0124 31.1625 13.9688 24.6205 4.5586 22.5763 19.2757 0.0698 0.1889 8.5612 1.4478 11.7732 0.6298 10.6694 14.1073 12.0937 14.4127 16.7092 23.7387 7.3459 1.9128 14.2909 27.4626 93.7217 115.3795 44.1044 35.4401 16.4853 20.3772 30.3763 2.4461 80.7692 50.6899 50.4862 43.4276 35.4325 10.3654 39.5417 45.4582 1.3492 16.5549 6.5772 59.6557 108.1307 15.4273 33.9457 58.1918 22.0161 32.6210 29.8579 23.2186 29.7449 27.0873 10.5360
temp: 298.150 k
press: 1.00000 atm
elementType: 8 6 6 6 6 6 6 6 6 6 6 6 6 6 6 6 6 6 6 6 1 1 1 1 1 1 1 1 1 1 1 1 1 1 1 1 1 1 1 1 1 1 1 1 1 1 1 1
symmnumber: 1
zpe: 1101329.7 jmol-1
zpe.correction: 0.419474 hartree
zpe.thermalcorrener: 0.441381 hartree
zpe.thermalcorrenthalpy: 0.442325 hartree
zpe.thermalcorrgfe: 0.369599 hartree
zpe.sumelectzpe: -814.525282 hartree
zpe.sumelectthermal: -814.503375 hartree
zpe.sumelectthermalent: -814.502431 hartree
zpe.sumelectthermalfe: -814.575157 hartree
dipole: 3.6428 -1.6021 -0.1656
dipole: 3.9830
quadrupole: -131.0106 -116.6674 -124.7021
quadrupole: 6.0259 0.8862 -0.9532
quadrupole: -6.8839 7.4593 -0.5754 6.0259 0.8862 -0.9532
hfenergy: -814.944756 hartree
pointgroup: C01 [X(C19H28O1)]
dipole: -1.4505012 -0.5766671 0.1382496 debye
polarizability: 266.2748701|-0.6993154|223.6040349|-1.4151018|-6.2477736|146.1261031 unknown
InChI: InChI=1S/C19H28O/c1-7-13-11-15-16(12-14(13)17(20)8-2)19(5,6)10-9-18(15,3)4/h11-12H,7-10H2,1-6H3
charge 0 multiplicity 1
48 atoms
O  4.002934 0.51637 0.006975
C  -2.663141 1.278052 0.148669
C  -1.809324 -1.721279 0.097649
C  -3.602865 0.083686 0.47874
C  -3.222898 -1.195524 -0.282794
C  -1.187927 0.820791 0.158584
C  -0.796694 -0.553647 0.124976
C  -3.003202 1.848397 -1.263279
C  -2.919311 2.389469 1.207292
C  -1.852245 -2.391876 1.505062
C  -1.407755 -2.796873 -0.952244
C  -0.167602 1.805047 0.176678
C  0.585808 -0.844888 0.155185
C  1.217017 1.524711 0.171501
C  1.608599 0.142244 0.171055
C  2.17854 2.705701 0.154963
C  3.045773 -0.295353 0.197069
C  2.631759 3.077798 -1.283232
C  3.364575 -1.779151 0.468175
C  4.872648 -2.052489 0.600178
H  -4.644101 0.376567 0.239703
H  -3.573291 -0.109855 1.569533
H  -3.963075 -1.994623 -0.081233
H  -3.255744 -1.003573 -1.373774
H  -2.332603 2.687205 -1.5233
H  -2.895888 1.081143 -2.050603
H  -4.044885 2.221268 -1.281711
H  -2.397585 3.332322 0.965461
H  -4.001964 2.613375 1.253104
H  -2.592205 2.065045 2.212004
H  -0.853015 -2.765501 1.7946
H  -2.178823 -1.682059 2.285854
H  -2.551749 -3.249479 1.500582
H  -0.478838 -3.329198 -0.678954
H  -2.209138 -3.555758 -1.032338
H  -1.261885 -2.343742 -1.949808
H  -0.460022 2.861818 0.198973
H  0.883759 -1.897363 0.153839
H  1.668484 3.578287 0.608009
H  3.079338 2.486206 0.750742
H  3.207286 2.248444 -1.726875
H  3.282604 3.971147 -1.261624
H  1.763528 3.297119 -1.931893
H  2.827692 -2.101424 1.382477
H  2.942975 -2.385877 -0.360178
H  5.304646 -1.487686 1.444142
H  5.057584 -3.129314 0.76525
H  5.411023 -1.734477 -0.308385
