program: Gaussian 09
title: 000226701
version: EM64L-G09RevD.01
frameworkgroup: C1[X(C16H23Cl)]
method: RPBEPBE
basis: SDD
operation: Freq
keyword: #p
keyword: freq=noraman
keyword: PBEPBE/SDD
title: #p freq=noraman PBEPBE/SDD
converged: NO YES NO NO
title: Mulliken charges:
elementType: Cl C C C C C C C C C C C C C C C C H H H H H H H H H H H H H H H H H H H H H H H
charge: -0.111371 0.176281 0.176634 -0.491259 -0.491938 0.346287 0.333420 -0.746744 -0.739560 -0.744258 -0.741583 -0.611264 -0.629768 0.430836 0.333862 -0.810391 -0.833555 0.201507 0.209641 0.201793 0.207986 0.221707 0.225931 0.213901 0.209876 0.213206 0.226441 0.223708 0.228050 0.213184 0.210105 0.214266 0.223253 0.231619 0.231596 0.274119 0.266087 0.224744 0.250425 0.231226
chargesum: 0.00000
title: Mulliken charges with hydrogens summed into heavy atoms:
elementType: Cl C C C C C C C C C C C C C C C C
charge: -0.111371 0.176281 0.176634 -0.080111 -0.082159 0.346287 0.333420 -0.085205 -0.090038 -0.079316 -0.093959 -0.379645 -0.398172 0.430836 0.333862 -0.270184 -0.127160
polarizability: 2.30320507e+02 6.41513144e-01 1.86335535e+02 2.18688669e-01 -3.00763230e-01 1.33875398e+02
1716.lowfreq: -17.2114 -10.6532 -0.0022 -0.0014 -0.0004 10.3864 35.1104 42.6704 47.8894
frequency: 34.3352 42.5234 47.8810 91.5090 127.3180 147.1701 176.8953 188.1595 206.9262 211.0464 220.6732 249.3717 250.9821 266.9390 268.7079 282.1116 309.8343 316.2240 342.0208 351.1646 380.5277 390.2960 418.7947 455.2109 480.9540 498.8155 506.3927 538.3561 567.3978 588.7709 630.4829 679.0836 699.1984 763.6069 770.7801 776.7624 836.8997 884.6611 900.9473 903.0770 916.7960 926.2382 927.9998 934.3472 951.0731 966.3865 993.7817 1002.4818 1016.2685 1021.9254 1045.7003 1061.0574 1081.0850 1108.6274 1120.2838 1165.2815 1181.2330 1191.3676 1203.6031 1216.3504 1231.3615 1241.5173 1254.0539 1259.0832 1286.9609 1307.3672 1343.4204 1344.1964 1367.4489 1373.8713 1375.0514 1384.2305 1393.7741 1397.2134 1399.3530 1453.1939 1459.4213 1459.9362 1462.7657 1466.1998 1470.6717 1471.8662 1476.3426 1479.1001 1481.9786 1484.5800 1485.7580 1489.9196 1501.1508 1561.6890 1620.4789 2970.4106 2970.9089 2971.6293 2972.6587 2974.2350 2976.5748 2980.9658 3024.1481 3034.0220 3048.4555 3064.2479 3064.8206 3067.4610 3069.1839 3070.4335 3075.5905 3077.8025 3080.8831 3082.5311 3084.7065 3118.4478 3126.0191 3147.5706
redmass: 3.0692 3.9743 6.5704 3.9513 3.0761 1.1285 1.9936 2.3061 1.5360 1.3996 1.5950 1.0881 1.3055 2.3134 2.5830 2.4230 2.4993 2.6808 2.4466 2.5767 2.7265 2.6407 3.1998 2.7412 3.2202 2.9272 2.9693 3.3531 5.8890 2.8342 3.6720 5.3936 5.4138 3.5848 2.8291 2.7354 2.0795 1.9499 1.4428 1.5776 1.6663 1.4952 1.5269 1.7010 2.0768 1.5092 2.0344 1.2806 1.7394 1.4561 1.5539 1.7713 1.6553 1.4694 1.5425 2.4216 3.2637 1.6013 2.8284 3.1101 2.6378 1.1900 1.9095 2.0451 1.3151 2.8637 1.4639 1.4472 5.6641 1.1932 1.2001 2.7184 1.2297 1.2435 1.4359 1.0671 1.1431 1.0602 1.0577 1.0587 1.0588 1.0864 1.0667 1.1728 1.0629 1.0820 1.0637 1.0872 2.3995 7.3178 6.5806 1.0387 1.0370 1.0388 1.0495 1.0408 1.0411 1.0551 1.0992 1.1026 1.0953 1.0994 1.0993 1.0577 1.0988 1.0982 1.0997 1.0996 1.0995 1.0989 1.0990 1.0897 1.0897 1.1111
irintensity: 0.0969 0.6868 1.0605 1.9870 1.7077 0.2747 0.7674 1.6821 0.0476 0.1075 0.5462 0.3545 0.0680 0.7137 0.3174 0.6472 0.5866 0.5293 0.6413 4.7212 0.8985 0.3196 6.9775 1.5431 5.1037 0.3335 5.5699 20.5064 52.7755 8.4798 12.8273 3.4747 7.8035 6.1747 2.2717 4.1801 0.7005 0.4933 6.0048 5.7910 6.2007 2.1676 0.7442 3.6397 2.0419 0.6521 18.4320 2.0396 6.4533 2.8925 7.8901 13.8878 3.7145 11.9072 9.5051 9.4110 1.9859 8.0980 5.0745 7.5779 7.2469 38.2338 23.2074 3.2130 1.8221 4.1311 2.8878 4.2526 0.9391 0.1636 39.2052 11.6666 0.3367 5.5783 32.5825 0.1489 13.9478 1.7016 2.4427 2.0000 15.1269 9.5397 13.7198 5.6106 32.1978 1.0703 4.8898 14.9311 35.1598 5.2004 19.8775 35.4518 7.5362 20.5880 38.1541 2.7709 87.4301 52.5522 40.4459 47.2351 16.4505 1.4901 4.7499 26.7172 25.7703 138.6601 15.4666 28.6406 51.2595 29.0627 14.9197 26.8658 12.7504 6.5855
temp: 298.150 k
press: 1.00000 atm
elementType: 17 6 6 6 6 6 6 6 6 6 6 6 6 6 6 6 6 1 1 1 1 1 1 1 1 1 1 1 1 1 1 1 1 1 1 1 1 1 1 1
symmnumber: 1
zpe: 907202.2 jmol-1
zpe.correction: 0.345535 hartree
zpe.thermalcorrener: 0.363865 hartree
zpe.thermalcorrenthalpy: 0.364809 hartree
zpe.thermalcorrgfe: 0.299945 hartree
zpe.sumelectzpe: -1082.281886 hartree
zpe.sumelectthermal: -1082.263556 hartree
zpe.sumelectthermalent: -1082.262612 hartree
zpe.sumelectthermalfe: -1082.327476 hartree
dipole: -2.6890 -0.5327 -1.6390
dipole: 3.1939
quadrupole: -117.7291 -105.6536 -113.2488
quadrupole: -3.1078 -8.2572 -1.6137
quadrupole: -5.5186 6.5569 -1.0383 -3.1078 -8.2572 -1.6137
hfenergy: -1082.6274212 hartree
pointgroup: C01 [X(C16H23Cl1)]
dipole: -1.0079277 0.2607723 0.7035965 debye
polarizability: 229.7994944|-3.0680845|186.5442271|-5.4754175|0.5013016|134.1877187 unknown
InChI: InChI=1S/C16H23Cl/c1-11-8-13-14(9-12(11)10-17)16(4,5)7-6-15(13,2)3/h8-9H,6-7,10H2,1-5H3
charge 0 multiplicity 1
40 atoms
Cl 4.500076 -0.917225 -1.156221
C  -1.406374 -1.720032 0.056692
C  -1.931945 1.34857 -0.137578
C  -2.729251 -1.077183 -0.450585
C  -3.014047 0.284501 0.20075
C  -0.280185 -0.661849 0.106004
C  -0.519381 0.744369 0.026447
C  -1.6154 -2.309058 1.485375
C  -1.044988 -2.883836 -0.910398
C  -2.103884 1.839464 -1.608207
C  -2.146387 2.558957 0.816311
C  1.058459 -1.097738 0.268439
C  0.596798 1.623955 0.064767
C  2.160042 -0.214896 0.329671
C  1.92926 1.189594 0.21169
C  3.53438 -0.768679 0.521572
C  3.072257 2.188272 0.235562
H  -3.562514 -1.779217 -0.250295
H  -2.676077 -0.958777 -1.551251
H  -4.000555 0.666647 -0.128168
H  -3.072763 0.166077 1.301225
H  -0.679599 -2.755467 1.868355
H  -1.931643 -1.533065 2.205163
H  -2.389549 -3.099641 1.464269
H  -0.193141 -3.485944 -0.54699
H  -1.911376 -3.564842 -1.010678
H  -0.788334 -2.501107 -1.914851
H  -1.332378 2.587714 -1.865845
H  -2.012623 1.007938 -2.329152
H  -3.097404 2.308513 -1.741285
H  -1.514811 3.424724 0.549522
H  -3.200602 2.890939 0.76124
H  -1.926435 2.28352 1.863893
H  1.262718 -2.172894 0.341037
H  0.419611 2.702534 -0.01955
H  3.534219 -1.799886 0.900755
H  4.197442 -0.130159 1.121663
H  3.57258 2.217996 1.223572
H  3.845176 1.930652 -0.511855
H  2.710729 3.207661 0.018834
