program: Gaussian 09
title: 000226686
version: EM64L-G09RevD.01
frameworkgroup: C1[X(C14H19Cl)]
method: RPBEPBE
basis: SDD
operation: Freq
keyword: #p
keyword: freq=noraman
keyword: PBEPBE/SDD
title: #p freq=noraman PBEPBE/SDD
converged: YES YES NO NO
title: Mulliken charges:
elementType: Cl C C C C C C C C C C C C C C H H H H H H H H H H H H H H H H H H H
charge: -0.075710 0.179261 0.182524 -0.491906 -0.490438 0.321543 0.328020 -0.742936 -0.740849 -0.742501 -0.742401 -0.332889 -0.390327 -0.166633 -0.292129 0.203992 0.209827 0.202766 0.209512 0.225106 0.226696 0.214764 0.211359 0.215213 0.225272 0.221650 0.227037 0.214352 0.208544 0.214888 0.225196 0.254799 0.232809 0.253588
chargesum: 0.00000
title: Mulliken charges with hydrogens summed into heavy atoms:
elementType: Cl C C C C C C C C C C C C C C
charge: -0.075710 0.179261 0.182524 -0.078087 -0.078159 0.321543 0.328020 -0.076369 -0.089005 -0.079462 -0.093773 -0.078090 -0.157518 -0.166633 -0.038541
polarizability: 1.96353645e+02 1.56782196e+00 1.63833697e+02 -1.03218284e-03 5.83833493e-02 1.06218040e+02
1716.lowfreq: -15.2911 -14.4346 -7.8357 -0.0009 -0.0008 0.0020 42.2685 63.1581 110.2725
frequency: 41.8999 63.1343 110.2551 156.4034 186.4834 194.0088 208.5240 227.6168 242.8963 248.8953 261.4533 273.3032 304.2898 310.3769 337.2148 364.4546 370.8766 388.3286 417.2090 458.7585 474.7148 506.0937 529.2327 569.7486 587.0071 605.4450 672.9311 743.0185 757.6536 820.3145 823.0410 836.5477 880.9262 889.4495 926.0494 928.1519 934.6252 951.7706 957.4414 967.6123 1003.2181 1022.3720 1057.3800 1061.6966 1082.1407 1093.6384 1106.8870 1142.7357 1182.4171 1189.6905 1194.2866 1218.9992 1235.0878 1260.5588 1273.0596 1296.2778 1344.7446 1345.2223 1360.8040 1375.5880 1377.2591 1382.5832 1396.1878 1398.7048 1453.8526 1459.3297 1461.8451 1462.9536 1467.4496 1472.9702 1476.2152 1482.0867 1484.6082 1486.9504 1488.6863 1567.2572 1597.1314 2971.7623 2972.3721 2973.7594 2974.3497 2976.8372 2981.3332 3025.3283 3034.6044 3063.8861 3065.6521 3070.8327 3071.6871 3076.2912 3077.3718 3080.7998 3081.8153 3136.9567 3156.7281 3170.0086
redmass: 2.9725 4.0664 3.3141 5.4008 1.6110 1.1662 1.9584 1.4906 1.2396 1.4757 2.1796 2.4395 2.5802 3.1594 2.4613 2.8323 2.7724 3.1563 2.7076 3.0422 3.5575 2.8445 2.9233 3.6100 4.3898 3.0057 6.0320 3.4228 3.2008 2.1308 1.6823 2.5836 1.6189 1.8633 1.5076 1.5207 1.7657 1.4344 1.7174 1.5019 1.2674 1.4555 2.5390 1.9847 1.6476 3.2900 1.7379 1.4942 3.0114 1.9717 2.2847 2.8452 2.0592 1.7852 1.5844 2.0467 1.4822 1.4909 6.0109 1.2186 1.1982 2.7004 1.2227 1.2646 1.0660 1.0892 1.5646 1.0758 1.1523 1.0991 1.0670 1.0552 1.1141 1.1046 1.0922 8.0488 6.9120 1.0391 1.0379 1.0483 1.0411 1.0420 1.0545 1.0991 1.1027 1.0993 1.0994 1.0989 1.0984 1.1002 1.1001 1.0993 1.0989 1.0878 1.0911 1.0962
irintensity: 0.0419 0.0469 0.4525 0.2123 0.2453 0.0364 0.0050 0.0609 0.0527 0.3915 0.5918 0.3671 0.3474 0.1635 0.4196 2.0175 1.5842 1.0491 2.5414 0.2041 1.4937 0.7703 14.2167 7.5405 1.8384 5.1548 0.9436 18.6953 0.5346 9.0950 29.7028 29.4726 10.6787 3.7217 1.6640 0.1866 3.2789 0.5709 2.5272 0.5662 0.7236 2.9562 27.6616 8.8084 5.3137 23.7739 15.8604 1.0882 0.0898 10.1009 3.6274 4.0825 4.0551 3.0642 6.4195 18.2105 3.2214 2.4380 0.2873 5.2893 34.2652 3.8726 0.0319 32.4336 0.0480 5.2786 21.5986 2.4991 1.2348 12.0691 13.3782 24.7615 23.2644 28.3339 24.5373 12.6126 24.4041 8.4589 11.6010 25.1883 32.6150 75.3551 45.9361 37.4900 47.6149 10.8912 4.6332 17.7943 124.5037 14.5998 40.6556 67.1088 14.0992 13.8061 3.9084 5.8701
temp: 298.150 k
press: 1.00000 atm
elementType: 17 6 6 6 6 6 6 6 6 6 6 6 6 6 6 1 1 1 1 1 1 1 1 1 1 1 1 1 1 1 1 1 1 1
symmnumber: 1
zpe: 761144.4 jmol-1
zpe.correction: 0.289905 hartree
zpe.thermalcorrener: 0.305187 hartree
zpe.thermalcorrenthalpy: 0.306132 hartree
zpe.thermalcorrgfe: 0.248643 hartree
zpe.sumelectzpe: -1003.824237 hartree
zpe.sumelectthermal: -1003.808955 hartree
zpe.sumelectthermalent: -1003.808010 hartree
zpe.sumelectthermalfe: -1003.865499 hartree
dipole: -3.1235 0.0481 0.0052
dipole: 3.1239
quadrupole: -105.0701 -91.6842 -101.2487
quadrupole: -0.2673 -0.0308 -0.2041
quadrupole: -5.7358 7.6502 -1.9144 -0.2673 -0.0308 -0.2041
hfenergy: -1004.1141421 hartree
pointgroup: C01 [X(C14H19Cl1)]
dipole: -1.2282249 0.0444168 -0.0025593 debye
polarizability: 196.1060698|-3.2322956|164.080958|0.0412466|0.1415451|106.2183537 unknown
InChI: InChI=1S/C14H19Cl/c1-13(2)7-8-14(3,4)12-9-10(15)5-6-11(12)13/h5-6,9H,7-8H2,1-4H3
charge 0 multiplicity 1
34 atoms
Cl 4.403121 -0.132192 0.007358
C  -0.667933 -1.75553 -0.004868
C  -1.655726 1.203584 0.005245
C  -2.111787 -1.301433 -0.361608
C  -2.532394 -0.024271 0.381311
C  0.291337 -0.543004 -0.012024
C  -0.159567 0.813894 0.00874
C  -0.648366 -2.406515 1.412299
C  -0.235961 -2.824589 -1.049466
C  -2.042577 1.72039 -1.414606
C  -1.94999 2.328587 1.039355
C  1.689831 -0.801842 -0.003815
C  0.813008 1.85024 -0.001653
C  2.612718 0.25174 -0.000518
C  2.198455 1.595313 -0.006147
H  -2.809342 -2.128562 -0.12447
H  -2.180436 -1.136562 -1.455296
H  -3.590601 0.215768 0.15881
H  -2.470294 -0.191825 1.475071
H  0.375131 -2.716795 1.690417
H  -1.004783 -1.706171 2.188443
H  -1.296131 -3.303475 1.429297
H  0.718524 -3.313661 -0.785242
H  -1.005409 -3.617508 -1.108142
H  -0.124566 -2.377697 -2.054128
H  -1.419533 2.586213 -1.703372
H  -1.904044 0.940889 -2.184686
H  -3.102214 2.039183 -1.429808
H  -1.483448 3.290888 0.762361
H  -3.041549 2.499018 1.101143
H  -1.587603 2.049349 2.045463
H  2.057708 -1.83177 -0.004889
H  0.483857 2.894846 0.000687
H  2.926661 2.4111 -0.010462
