program: Gaussian 09
title: 000226660
version: EM64L-G09RevD.01
frameworkgroup: C1[X(C16H22O3)]
method: RPBEPBE
basis: SDD
operation: Freq
keyword: #pfreq=noraman
keyword: PBEPBE/SDD
title: #p freq=noraman PBEPBE/SDD
converged: YES YES NO NO
title: Mulliken charges:
elementType: O O O C C C C C C C C C C C C C C C C H H H H H H H H H H H H H H H H H H H H H H
charge: -0.207593 -0.202681 -0.202681 0.287621 0.287616 0.029373 -0.474028 -0.474024 -0.457358 -0.482086 -0.482431 -0.482079 -0.482424 -0.517160 -0.526060 -0.517156 -0.526053 0.197053 0.197043 0.211596 0.216507 0.216507 0.211595 0.214598 0.216537 0.217897 0.224980 0.220655 0.221095 0.224978 0.217897 0.221095 0.220654 0.234067 0.245436 0.235251 0.274510 0.245436 0.234061 0.274505 0.235252
chargesum: 0.00000
title: Mulliken charges with hydrogens summed into heavy atoms:
elementType: O O O C C C C C C C C C C C C C C C C
charge: -0.207593 -0.202681 -0.202681 0.287621 0.287616 0.029373 -0.045926 -0.045922 -0.026223 -0.039209 -0.040681 -0.039205 -0.040675 -0.037657 -0.016298 -0.037658 -0.016296 0.197053 0.197043
polarizability: 1.91685652e+02 1.81382245e-04 1.64558672e+02 -8.25058852e-05 1.02333975e+00 1.45215589e+02
1716.lowfreq: -19.1490 -13.4120 -0.0005 -0.0003 -0.0001 2.2259 32.2622 51.0870 56.7241
frequency: 31.8694 51.0859 56.7241 62.2794 125.2334 136.2457 150.4318 193.7360 211.6845 228.2617 245.1291 267.6686 285.5694 313.7909 337.5731 348.7625 371.4816 409.0921 412.9890 421.4020 432.8817 463.3776 473.9233 489.6762 490.0173 541.3314 552.0885 603.9824 674.8445 676.7112 729.2465 729.5703 741.4608 748.0633 751.2449 793.3807 831.5107 848.8824 895.5653 904.0463 915.3579 930.1545 940.9814 945.9977 951.5468 980.9242 1004.2965 1026.5784 1032.4928 1035.5328 1039.8299 1082.3646 1091.8198 1099.9616 1124.5064 1126.8702 1129.4230 1133.4091 1136.7161 1150.4324 1176.7450 1198.4918 1210.8866 1226.2046 1232.2792 1248.0292 1261.6659 1261.8319 1275.5987 1287.3093 1294.9430 1295.6781 1319.1575 1326.6071 1328.0451 1332.2240 1339.3284 1340.5827 1348.5713 1352.5248 1354.6965 1433.1301 1434.6997 1445.1260 1449.2129 1452.7214 1456.0012 1460.5823 1469.9670 1474.1103 1476.4474 1482.1572 1574.8507 1635.0368 1636.4656 2961.6771 2962.8520 2974.4972 2974.8316 2978.9596 2979.7019 2986.2518 2986.8317 2987.7393 2998.4080 2998.6432 3020.1369 3025.7309 3038.2439 3038.6217 3044.7637 3049.6208 3058.1901 3072.7429 3073.0680 3075.3725 3075.6319
redmass: 9.5684 3.4069 9.8439 5.5356 4.4198 3.3154 3.7691 3.2152 2.5013 2.0216 2.3356 2.5368 2.9284 2.7833 3.0165 3.7438 1.9725 3.2760 2.3249 3.8498 3.1865 2.1926 2.9485 3.0369 3.2410 3.7720 2.5670 2.8862 3.4175 3.4444 3.4859 4.2997 3.1920 1.5936 1.5943 2.2681 2.4207 1.8416 2.2794 1.9770 1.6227 2.1675 1.8062 2.2883 1.7938 2.0918 3.0452 2.5822 1.9624 2.1581 2.2902 1.8528 2.1074 1.4218 1.8445 2.6930 1.9547 2.0565 1.9605 1.3901 1.3474 2.4974 1.6142 1.4863 1.3994 1.3724 1.5925 1.6351 1.7772 1.4324 1.3003 1.2764 1.5503 1.3757 1.4176 1.5439 1.5004 1.5070 1.4205 1.4323 1.4158 1.0910 1.0950 1.0843 1.0987 1.0842 1.0885 1.0833 1.0899 1.0838 1.0896 1.0911 8.7988 9.2108 9.3090 1.0614 1.0616 1.0623 1.0629 1.0661 1.0661 1.0634 1.0615 1.0624 1.0605 1.0605 1.1007 1.0958 1.0991 1.0994 1.1021 1.0977 1.0946 1.0984 1.0985 1.1006 1.1004
irintensity: 1.2961 0.0216 5.1741 1.8550 5.7762 0.2927 2.2946 2.4952 0.4995 0.0180 0.5974 0.0068 1.5659 0.1927 0.1642 12.4252 0.5716 4.1736 11.2289 0.0069 6.5126 0.8676 1.0590 5.7578 0.7303 1.9264 0.0884 0.0658 2.6122 10.5115 6.1803 0.5209 2.7877 0.0143 5.1433 23.0891 0.6913 42.7001 1.5185 7.4299 5.3193 40.4207 0.4066 0.1475 15.3121 13.3339 6.8646 11.4029 7.1859 25.2038 3.2638 2.3964 2.9056 7.7334 10.1984 0.4102 0.3594 5.4953 21.5144 20.8957 2.4188 35.7251 0.1880 9.3148 22.3418 0.6895 1.4392 16.4780 34.8385 5.5864 0.0880 7.2570 3.3087 12.5711 0.0346 15.9893 5.4305 1.7058 1.0067 2.1314 0.6910 7.9150 44.8804 0.0027 40.1511 0.0470 9.6841 0.5668 24.2388 17.8974 9.1391 16.9837 87.8530 271.1794 137.8060 18.3842 17.2136 18.8734 58.2803 8.3516 38.2636 6.8650 7.3024 44.7375 23.9902 21.3431 32.4663 32.4612 3.4798 40.5150 56.0112 56.8950 29.3730 0.1023 38.8804 23.6909 0.1743
temp: 298.150 k
press: 1.00000 atm
elementType: 8 8 8 6 6 6 6 6 6 6 6 6 6 6 6 6 6 6 6 1 1 1 1 1 1 1 1 1 1 1 1 1 1 1 1 1 1 1 1 1 1
symmnumber: 1
zpe: 916138.7 jmol-1
zpe.correction: 0.348939 hartree
zpe.thermalcorrener: 0.366311 hartree
zpe.thermalcorrenthalpy: 0.367255 hartree
zpe.thermalcorrgfe: 0.304042 hartree
zpe.sumelectzpe: -847.118530 hartree
zpe.sumelectthermal: -847.101158 hartree
zpe.sumelectthermalent: -847.100214 hartree
zpe.sumelectthermalfe: -847.163427 hartree
dipole: 0.0000 6.4335 -0.3555
dipole: 6.4433
quadrupole: -148.7166 -121.2470 -110.3234
quadrupole: -0.0001 0.0000 -0.9992
quadrupole: -21.9542 5.5153 16.4389 -0.0001 0.0000 -0.9992
hfenergy: -847.4674693 hartree
pointgroup: C01 [X(C16H22O3)]
dipole: 0.0001895 2.5293326 -0.1692969 debye
polarizability: 191.685652|-0.0017297|164.579856|0.0036239|0.7981343|145.1944057 unknown
InChI: InChI=1S/C16H22O3/c17-12-2-8-15(9-3-12)6-1-7-16(14(15)19)10-4-13(18)5-11-16/h1-11H2
charge 0 multiplicity 1
41 atoms
O  -0.000192 -0.652672 1.345735
O  -4.270735 -2.138518 -0.365925
O  4.270422 -2.139085 -0.365251
C  -1.35761 0.928111 0.07846
C  1.357646 0.927925 0.07867
C  -0.00006 0.337352 0.556434
C  -1.257168 2.473865 -0.115968
C  1.257446 2.473693 -0.115771
C  0.00023 2.925306 -0.880329
C  -1.788132 0.258169 -1.277229
C  -2.482536 0.65491 1.130431
C  1.788304 0.257932 -1.276949
C  2.482371 0.65457 1.130815
C  -2.133351 -1.24678 -1.145642
C  -2.989892 -0.808788 1.240421
C  2.133288 -1.247067 -1.145321
C  2.989501 -0.8092 1.240899
C  -3.23808 -1.462472 -0.111659
C  3.237776 -1.462971 -0.111123
H  -1.253947 2.95783 0.882919
H  -2.176338 2.818723 -0.629082
H  2.176744 2.818427 -0.628739
H  1.254135 2.957655 0.883118
H  0.000283 2.522509 -1.911372
H  0.000312 4.027618 -0.976669
H  -1.021343 0.396906 -2.059366
H  -2.68976 0.802339 -1.625477
H  -3.337618 1.306348 0.857432
H  -2.134616 0.98469 2.127696
H  2.69007 0.801979 -1.625032
H  1.021675 0.396787 -2.059223
H  2.134347 0.984414 2.128022
H  3.337588 1.305881 0.857937
H  -1.239141 -1.812308 -0.814526
H  -2.461817 -1.663289 -2.113585
H  -3.918028 -0.858858 1.836228
H  -2.211098 -1.40459 1.753856
H  2.461887 -1.663596 -2.113211
H  1.238932 -1.812482 -0.814405
H  2.210557 -1.404879 1.754247
H  3.917549 -0.859386 1.836834
