program: Gaussian 09
title: 000226659
version: EM64L-G09RevD.01
frameworkgroup: C1[X(C16H19NO4)]
method: RPBEPBE
basis: SDD
operation: Freq
keyword: #p
keyword: freq=noraman
keyword: PBEPBE/SDD
title: #p freq=noraman PBEPBE/SDD
converged: YES YES NO NO
title: Mulliken charges:
elementType: O O O O N C C C C C C C C C C C C C C C C H H H H H H H H H H H H H H H H H H H
charge: -0.233953 -0.231919 -0.265599 -0.234331 -0.185088 0.176777 -0.548891 -0.439592 0.111280 -0.490285 0.409541 -0.536093 0.187793 -0.385763 -0.390154 -0.611667 0.232650 -0.236642 -0.249218 -0.241086 -0.504950 0.235206 0.224608 0.256353 0.235986 0.254420 0.265526 0.244645 0.287132 0.260811 0.229215 0.268125 0.248500 0.250360 0.229096 0.228079 0.232307 0.239601 0.233862 0.243357
chargesum: 0.00000
title: Mulliken charges with hydrogens summed into heavy atoms:
elementType: O O O O N C C C C C C C C C C C C C C C C
charge: -0.233953 -0.231919 -0.265599 -0.234331 -0.185088 0.176777 -0.089077 0.052747 0.111280 0.029662 0.409541 -0.004316 0.187793 -0.124952 -0.160939 0.155318 0.232650 -0.007547 -0.021139 -0.008778 0.211870
polarizability: 1.96501639e+02 -1.47462594e+01 1.91574714e+02 2.85041649e+00 -1.91473600e+00 1.65198754e+02
1716.lowfreq: -18.4876 -5.1787 -0.0007 -0.0007 0.0004 2.1035 9.5675 15.2464 33.0345
frequency: -16.3267 15.1857 32.9959 36.9991 50.5680 82.2816 90.8391 98.6430 118.5287 124.0160 148.6275 167.0197 172.1149 207.2155 232.1619 249.1360 261.8060 292.2063 303.0969 340.3131 366.7918 382.8470 400.1867 422.4620 444.9520 464.7532 517.3534 535.7631 553.2794 571.8622 590.1774 617.1694 633.0480 661.1145 685.3579 704.4892 720.5652 742.2405 770.4627 798.6662 853.1113 854.9544 875.3775 894.6442 920.9274 926.3141 955.7767 980.3404 990.4969 999.2742 1005.4219 1021.5665 1030.3970 1047.0765 1080.7475 1085.7550 1112.0492 1114.1412 1119.0929 1125.3658 1141.3257 1141.7798 1148.8610 1153.6976 1176.2878 1198.1456 1204.4298 1213.5881 1239.8247 1278.0046 1291.0843 1307.6728 1314.7627 1326.0957 1331.4559 1346.8368 1366.0723 1377.0400 1423.1515 1423.9693 1435.5679 1441.9344 1445.2457 1453.4173 1456.6910 1464.4554 1476.2269 1477.5890 1479.6777 1488.8369 1574.3053 1590.3744 1610.4048 1628.0059 1647.0575 2994.7857 3000.0876 3004.3415 3010.0163 3015.4378 3016.6485 3056.5261 3064.7564 3076.9982 3084.4548 3105.6177 3107.7835 3124.0312 3130.8238 3142.3525 3145.2867 3149.3518 3150.7393 3166.3499
redmass: 3.8456 6.9686 3.5650 6.6093 5.1740 3.7455 2.8231 1.0795 1.2113 3.5772 3.7456 3.1931 4.6337 4.7313 4.3012 3.2306 2.9271 4.2134 3.6070 2.5485 3.8428 6.8646 2.8237 4.9981 4.7013 4.4294 5.1350 3.5208 2.6793 3.1525 4.4766 6.3869 4.2352 5.5339 4.1751 1.7157 6.3995 1.6614 1.9405 2.8072 1.4555 2.9974 2.3609 3.0525 1.8881 1.6803 5.4351 1.3932 5.7055 1.3435 2.6872 2.7879 2.1159 2.1576 3.4205 1.8188 2.1244 1.3477 2.7091 1.3296 3.9315 2.7045 1.4416 1.7254 1.0537 1.4651 1.1376 1.8836 1.7367 1.6803 1.8970 3.5055 1.3605 1.4637 1.4944 1.4669 1.5373 6.4642 1.1892 1.2236 2.1803 1.0869 1.0918 1.0499 1.0946 1.0509 1.0715 1.0530 1.3921 1.4705 10.3253 5.8821 5.9919 9.8722 8.7850 1.0627 1.0655 1.0299 1.0609 1.0623 1.0331 1.0950 1.0990 1.0970 1.1015 1.1045 1.1020 1.0847 1.0870 1.0918 1.1023 1.1047 1.0959 1.1016
irintensity: 0.0772 1.6672 0.2090 0.2941 0.5993 2.5592 1.6576 0.2523 0.9499 1.4611 7.3681 10.0809 1.0520 0.4898 3.5894 1.7410 2.2249 20.0922 0.7220 4.7868 9.6877 20.2754 0.0041 4.8427 3.4440 5.3268 2.3005 18.7485 0.8447 19.1979 17.2515 0.2903 1.6870 0.4626 16.4714 52.5621 6.6134 4.6180 31.6518 7.9675 2.9381 6.3124 2.0020 10.5104 3.0519 2.0345 20.5389 0.0490 1.0535 0.0672 11.4673 8.0372 34.4094 52.5949 31.5039 5.6021 125.4258 17.6958 54.1819 0.6070 204.9936 16.0097 3.1573 19.9627 0.0700 26.5915 1.6306 6.7854 36.4099 49.4690 191.4851 68.9946 22.5889 8.7597 7.9272 9.0125 18.5809 0.3179 31.1640 71.9453 4.0674 7.6875 10.4996 13.9021 35.3474 13.9279 12.8616 23.5706 28.2720 13.6228 349.1284 5.2800 14.0022 98.1720 152.6526 7.5452 6.1558 38.2366 37.6660 11.1285 21.9818 2.6048 23.3532 12.5218 9.8233 26.8673 15.7493 3.6917 0.7789 15.6876 1.0332 16.5664 27.4561 22.9222
temp: 298.150 k
press: 1.00000 atm
elementType: 8 8 8 8 7 6 6 6 6 6 6 6 6 6 6 6 6 6 6 6 6 1 1 1 1 1 1 1 1 1 1 1 1 1 1 1 1 1 1 1
symmnumber: 1
zpe: 844685.5 jmol-1
zpe.correction: 0.321724 hartree
zpe.thermalcorrener: 0.341654 hartree
zpe.thermalcorrenthalpy: 0.342598 hartree
zpe.thermalcorrgfe: 0.271160 hartree
zpe.sumelectzpe: -975.218195 hartree
zpe.sumelectthermal: -975.198265 hartree
zpe.sumelectthermalent: -975.197321 hartree
zpe.sumelectthermalfe: -975.268759 hartree
dipole: 0.9738 0.7553 -1.5505
dipole: 1.9807
quadrupole: -118.1384 -130.3081 -118.1154
quadrupole: -17.9475 -6.3885 -4.2121
quadrupole: 4.0489 -8.1208 4.0719 -17.9475 -6.3885 -4.2121
hfenergy: -975.5399186 hartree
pointgroup: C01 [X(C16H19N1O4)]
dipole: -0.3630757 0.3475456 0.5955023 debye
polarizability: 199.466764|13.8878245|188.5042058|3.6215204|1.5202886|165.3041377 unknown
InChI: InChI=1S/C16H19NO4/c1-17-13(18)8-10-16(15(17)20,11-9-14(19)21-2)12-6-4-3-5-7-12/h3-7H,8-11H2,1-2H3
charge 0 multiplicity 1
40 atoms
O  -0.279794 -1.182885 -1.849704
O  2.537199 -3.454137 1.071886
O  -4.863207 -0.105936 -0.059276
O  -3.798793 1.965399 -0.038443
N  1.108005 -2.298959 -0.372158
C  0.141902 -0.040078 0.297705
C  0.203475 -0.652134 1.72441
C  -1.200472 0.720915 0.044248
C  0.28372 -1.195698 -0.718966
C  1.521961 -1.411505 1.941087
C  1.28996 0.983389 0.053619
C  -2.479702 -0.127139 0.183502
C  1.778183 -2.467998 0.877157
C  1.896929 1.119879 -1.221679
C  1.686117 1.876367 1.083524
C  1.288686 -3.343164 -1.413039
C  -3.733545 0.716446 0.015838
C  2.884725 2.103116 -1.452989
C  2.670522 2.862202 0.853341
C  3.279114 2.978192 -0.41676
C  -6.160237 0.598095 -0.20915
H  -0.644294 -1.349089 1.860931
H  0.085352 0.135962 2.488195
H  -1.168038 1.146932 -0.973228
H  -1.242513 1.577677 0.742174
H  1.550617 -1.92778 2.915689
H  2.378773 -0.710256 1.926343
H  -2.551699 -0.61547 1.174781
H  -2.503392 -0.935196 -0.569189
H  1.588694 0.468387 -2.046578
H  1.224984 1.817466 2.075771
H  1.972997 -4.101604 -1.007608
H  1.708919 -2.892264 -2.326439
H  0.31606 -3.7938 -1.668483
H  3.341044 2.187438 -2.445585
H  2.958446 3.540264 1.664582
H  4.044268 3.741216 -0.596597
H  -6.333514 1.269839 0.648541
H  -6.911463 -0.203083 -0.244431
H  -6.166988 1.191295 -1.138923
