program: Gaussian 09
title: 000226654
version: EM64L-G09RevD.01
frameworkgroup: C1[X(C14H14O5)]
method: RPBEPBE
basis: SDD
operation: Freq
keyword: #pfreq=noraman
keyword: PBEPBE/SDD
title: #p freq=noraman PBEPBE/SDD
converged: YES YES NO NO
title: Mulliken charges:
elementType: O O O O O C C C C C C C C C C C C C C H H H H H H H H H H H H H H
charge: -0.426953 -0.215103 -0.196733 -0.412819 -0.234469 0.139150 -0.496220 -0.491493 0.358662 -0.543254 0.107105 0.036149 0.119109 -0.499323 -0.382741 -0.365233 -0.248140 -0.238825 0.173611 0.238883 0.246383 0.259466 0.250238 0.254566 0.249294 0.274427 0.265570 0.256291 0.283714 0.234955 0.238036 0.384847 0.380850
chargesum: 0.00000
title: Mulliken charges with hydrogens summed into heavy atoms:
elementType: O O O O O C C C C C C C C C C C C C C
charge: -0.042106 -0.215103 -0.196733 -0.031969 -0.234469 0.139150 -0.010955 0.018211 0.358662 -0.039395 0.107105 0.036149 0.119109 0.040675 -0.126450 -0.081518 -0.013185 -0.000789 0.173611
polarizability: 1.71639896e+02 6.07655236e+00 1.66415456e+02 -1.72844649e+01 1.70102787e+01 1.38016979e+02
1716.lowfreq: -9.3920 -7.3093 -0.0003 0.0002 0.0003 5.4685 21.5314 22.8436 31.3634
frequency: 21.4746 22.7513 31.3276 38.0259 80.2387 86.0138 126.4295 135.2859 157.4146 198.9791 234.9876 255.7355 283.1526 319.8618 325.1621 357.2857 399.8560 430.3248 439.1132 450.2511 491.1554 516.5593 542.8513 551.7455 564.3971 587.9748 596.6947 617.0974 653.3741 664.7021 673.0675 724.4793 743.2664 761.8447 775.8518 784.3150 826.7479 873.7142 895.1915 903.3751 926.2444 984.9053 1007.9581 1008.7430 1010.6452 1028.2196 1043.8273 1055.4281 1063.1468 1068.5502 1093.9883 1109.0644 1135.4404 1170.8355 1178.3861 1184.6237 1197.7884 1244.4816 1249.8744 1264.2591 1279.6158 1290.2211 1297.1666 1322.7140 1329.3504 1352.6839 1374.9957 1381.2951 1437.3679 1443.6244 1446.4486 1468.9091 1474.8776 1495.0298 1572.5503 1589.2926 1619.0920 1649.9631 1662.4612 2973.1402 2986.8813 3006.9296 3020.5094 3063.9889 3069.7632 3076.6200 3085.4401 3132.6141 3145.2461 3155.8412 3168.6295 3510.7175 3515.6296
redmass: 8.7130 11.8194 6.7050 8.4018 4.3870 5.4180 4.9597 3.1337 3.4665 6.9431 5.2352 3.8530 3.5367 3.3554 3.3889 5.2773 3.4309 4.6415 3.7400 4.6375 4.3846 2.2385 2.4208 4.4019 4.0869 1.9336 2.2944 2.6629 1.4563 3.5449 4.3471 4.7309 4.8505 3.2518 1.4969 1.6103 2.2800 3.3979 1.8832 1.8948 2.2249 1.3992 2.5482 2.1575 1.7606 3.3655 2.6917 2.5570 2.3219 2.9634 2.3275 2.3411 1.9681 1.4732 1.0989 1.3990 1.5834 1.7497 1.4954 1.5459 1.9632 1.8645 1.6425 1.4639 1.5058 1.4396 1.6857 10.4092 2.0099 1.1380 1.1181 1.2273 1.8642 1.1182 7.6704 7.3926 7.3777 9.5590 8.1847 1.0671 1.0658 1.0617 1.0605 1.0959 1.0932 1.1013 1.0993 1.0856 1.0892 1.0943 1.1006 1.0639 1.0642
irintensity: 1.6819 0.7033 0.7942 2.7812 0.5659 1.3724 0.3750 2.0093 1.6283 2.2745 0.5500 0.4728 2.2206 3.4483 3.8689 7.5500 2.1337 0.9012 15.7056 10.4285 7.9268 31.5280 12.6418 12.7426 47.7616 61.4154 46.6800 29.4131 118.1566 27.2239 4.3441 17.2250 7.2830 9.9287 38.4396 26.8435 4.8071 3.5891 6.7733 15.7528 44.5363 7.5740 56.4070 118.9442 71.1979 34.9850 45.6266 78.0656 91.1505 6.4870 68.6061 30.2091 4.8335 5.0085 3.3153 5.3947 29.5576 19.9689 4.2463 30.1303 18.1444 71.0313 31.5577 8.5283 19.7154 18.2314 55.3629 4.8937 21.8563 10.5373 12.8012 6.7310 15.3341 20.7814 44.0727 131.8626 33.2367 180.6297 213.3515 6.9640 8.1156 26.5007 7.7274 0.9421 16.7613 17.9760 16.5090 0.9611 7.0798 9.9342 25.8252 26.7222 31.3695
temp: 298.150 k
press: 1.00000 atm
elementType: 8 8 8 8 8 6 6 6 6 6 6 6 6 6 6 6 6 6 6 1 1 1 1 1 1 1 1 1 1 1 1 1 1
symmnumber: 1
zpe: 667325.4 jmol-1
zpe.correction: 0.254171 hartree
zpe.thermalcorrener: 0.271531 hartree
zpe.thermalcorrenthalpy: 0.272476 hartree
zpe.thermalcorrgfe: 0.206244 hartree
zpe.sumelectzpe: -916.648395 hartree
zpe.sumelectthermal: -916.631035 hartree
zpe.sumelectthermalent: -916.630090 hartree
zpe.sumelectthermalfe: -916.696322 hartree
dipole: -3.3362 -0.6766 -0.3211
dipole: 3.4193
quadrupole: -121.6329 -92.6166 -117.6345
quadrupole: -1.5595 9.4578 1.7092
quadrupole: -11.0049 18.0114 -7.0065 -1.5595 9.4578 1.7092
hfenergy: -916.902566 hartree
pointgroup: C01 [X(C14H14O5)]
dipole: 1.340699 -0.0753237 0.0807403 debye
polarizability: 172.1189685|-6.4250529|163.2823908|-15.7108719|-20.0308718|140.670972 unknown
InChI: InChI=1S/C14H14O5/c15-11-5-7-14(13(18)19,8-6-12(16)17)10-4-2-1-3-9(10)11/h1-4,16,18H,5-8H2
charge 0 multiplicity 1
33 atoms
O  0.59393 -3.153558 -0.995772
O  -3.471704 -0.291183 1.959106
O  -0.93627 -1.835482 -2.127298
O  4.334167 1.550606 1.37702
O  4.042738 1.072057 -0.874394
C  0.23447 -0.916761 -0.104351
C  -0.081138 -1.528261 1.297585
C  1.773958 -0.64551 -0.230823
C  -0.623938 0.341934 -0.339673
C  -1.589974 -1.766497 1.495893
C  -1.858026 0.531019 0.355456
C  -2.393458 -0.481519 1.323647
C  -0.127611 -1.961551 -1.186023
C  2.304159 0.409405 0.763679
C  -0.222994 1.327942 -1.273264
C  -2.640733 1.692922 0.117958
C  -1.008057 2.476448 -1.507644
C  -2.223561 2.665323 -0.806811
C  3.617812 1.010729 0.300871
H  0.276353 -0.825535 2.073537
H  0.47722 -2.472838 1.414141
H  2.299753 -1.603637 -0.075863
H  2.025557 -0.32067 -1.256209
H  -1.812431 -2.185235 2.492441
H  -1.963906 -2.501432 0.752173
H  1.588441 1.251246 0.856973
H  2.44428 0.004501 1.779809
H  0.709942 1.205951 -1.832398
H  -3.579309 1.792863 0.673304
H  -0.673713 3.22066 -2.238882
H  -2.834559 3.555588 -0.989359
H  0.350177 -3.798963 -1.713316
H  5.168423 1.975337 1.036489
