program: Gaussian 09
title: 000226652
version: EM64L-G09RevD.01
frameworkgroup: C1[X(C14H10O2)]
method: RPBEPBE
basis: SDD
operation: Freq
keyword: #pfreq=noraman
keyword: PBEPBE/SDD
title: #p freq=noraman PBEPBE/SDD
converged: YES YES NO NO
title: Mulliken charges:
elementType: O O C C C C C C C C C C C C C C H H H H H H H H H H
charge: -0.230629 -0.143258 -0.477526 0.247199 0.521185 0.170780 0.135772 -0.391006 -0.415718 -0.371414 -0.336866 -0.238258 -0.206655 -0.227607 -0.227423 -0.240086 0.280160 0.254463 0.234046 0.245754 0.260304 0.231988 0.234487 0.229569 0.228932 0.231808
chargesum: 0.00000
title: Mulliken charges with hydrogens summed into heavy atoms:
elementType: O O C C C C C C C C C C C C C C
charge: -0.230629 -0.143258 -0.197366 0.247199 0.521185 0.170780 0.135772 -0.136543 -0.181673 -0.125660 -0.076562 -0.006270 0.027833 0.001963 0.001508 -0.008278
polarizability: 1.98420361e+02 -1.03786064e+01 1.35706426e+02 1.54036141e+01 -4.49980740e+00 1.04820906e+02
1716.lowfreq: -9.7153 -4.0304 0.0001 0.0006 0.0008 9.3531 24.9102 48.2123 66.6407
frequency: 24.5925 48.1946 66.6373 111.2929 197.9991 228.9018 246.3135 283.5077 343.2648 403.4550 425.1726 470.6945 477.9343 483.4940 540.3339 582.1120 611.7327 619.9135 639.4113 674.4618 704.3464 720.4433 752.3492 763.8500 818.4370 831.6966 837.9435 853.9360 873.1029 884.0763 930.0462 948.0101 979.1937 982.4737 985.0084 992.6808 999.0856 1015.4402 1027.3516 1083.1951 1103.4329 1163.9931 1166.2647 1174.1408 1188.5293 1191.5190 1198.1020 1214.0973 1259.1447 1286.5684 1332.7657 1383.3454 1396.3471 1441.6940 1447.8039 1467.0845 1483.5015 1594.7796 1605.5978 1612.1531 1624.7019 1734.8437 2992.1937 3123.4334 3127.0003 3136.4182 3139.1513 3147.8595 3150.3512 3165.1740 3166.7356 3180.8810
redmass: 3.9545 5.1555 5.3932 7.3896 5.3066 4.7232 5.8942 5.5622 5.8608 2.8078 3.3626 6.0352 5.8256 4.3153 4.0895 6.1280 5.8384 6.5153 7.2565 6.3564 1.8301 3.5592 2.2374 1.3284 4.7370 3.6284 4.9712 1.2551 1.6500 3.3648 1.5800 1.4068 1.4611 5.2211 1.3332 6.3948 1.3307 2.0631 2.2342 1.6272 1.9067 2.3148 1.1734 1.0576 1.5657 1.1863 1.3740 1.8671 2.7836 1.5553 1.2948 8.2549 7.2786 2.2242 2.4227 2.8816 2.2841 6.1715 7.2387 6.1236 7.9516 12.8526 1.0819 1.0864 1.0873 1.0862 1.0917 1.0915 1.0963 1.0967 1.1016 1.0981
irintensity: 0.2802 0.1026 1.3732 0.7110 1.4118 3.0712 0.2750 0.8988 0.1012 0.1395 5.0077 4.2193 9.6935 7.3639 4.9594 11.7927 4.2205 3.2547 16.3265 0.7141 48.2120 8.7514 33.3570 86.7474 4.3572 71.0387 78.0775 0.0163 6.8090 15.7616 11.4249 2.4536 7.0236 166.0836 3.1795 17.2041 1.3660 6.6938 9.2362 7.9203 28.6191 13.8916 9.5765 0.3044 13.3259 2.5062 3.4324 29.9096 11.6255 7.0417 2.8635 0.1723 1.4904 9.2303 56.6220 40.7814 23.6789 0.7942 2.7911 9.1654 42.4601 314.2303 4.3499 5.2748 0.6550 0.2502 12.8106 12.4797 33.0980 19.0068 21.3532 7.4011
temp: 298.150 k
press: 1.00000 atm
elementType: 8 8 6 6 6 6 6 6 6 6 6 6 6 6 6 6 1 1 1 1 1 1 1 1 1 1
symmnumber: 1
zpe: 519548.3 jmol-1
zpe.correction: 0.197886 hartree
zpe.thermalcorrener: 0.209999 hartree
zpe.thermalcorrenthalpy: 0.210943 hartree
zpe.thermalcorrgfe: 0.157922 hartree
zpe.sumelectzpe: -688.847777 hartree
zpe.sumelectthermal: -688.835664 hartree
zpe.sumelectthermalent: -688.834720 hartree
zpe.sumelectthermalfe: -688.887741 hartree
dipole: 0.4332 -4.2305 -1.2384
dipole: 4.4293
quadrupole: -77.9815 -101.7962 -87.8248
quadrupole: -0.4834 2.7548 -4.6675
quadrupole: 11.2193 -12.5953 1.3760 -0.4834 2.7548 -4.6675
hfenergy: -689.0456628 hartree
pointgroup: C01 [X(C14H10O2)]
dipole: 0.1717833 -1.7139732 0.2636612 debye
dipolederiv: -1.2797171 0.6627345 -0.4020641 0.2046441 -0.7797171 0.1705135 -0.5684633 0.326728 -0.3650199 -0.6867225 0.3803929 -0.1910062 0.3223267 -1.005026 0.2841575 -0.2234366 0.2123755 -0.3950017 -0.0508253 -0.0978059 -0.0556131 -0.2738716 -0.244074 0.0044101 -0.0986677 -0.0292922 0.1607794 0.0808108 -0.1757086 0.075957 0.0913599 -0.245596 0.0722672 0.2034411 -0.054718 -0.0498627 0.3632521 0.1654655 -0.0718052 0.2223484 -0.0268677 -0.0174516 -0.1501523 -0.0275772 -0.0023716 0.3044241 -0.2957598 0.0990581 -0.6063173 0.8630861 -0.2764087 0.1098671 -0.1574518 0.1295651 1.49996 -0.7227651 0.572825 0.0571385 1.2561722 -0.2410696 0.7310671 -0.3539402 0.4755573 0.0152441 0.0736236 0.0726517 -0.0306409 0.0930019 -0.0098775 0.0636989 0.0221848 -0.0816408 -0.1643849 0.0006058 -0.0097376 -0.0061379 -0.1199029 -0.0667324 0.0582724 -0.0338305 0.0819444 -0.102085 -0.0246585 0.0843259 -0.0230594 -0.1286899 0.0016435 0.0957877 0.0152227 -0.0487608 -0.1075134 0.1869533 0.0333779 0.1190575 -0.1138537 0.0575223 0.0114456 0.0894696 -0.1405137 -0.1543164 -0.0358593 0.0193601 -0.0511859 0.0309044 -0.030321 0.0144766 -0.0240484 -0.1566467 0.0516953 -0.0407979 0.1137788 0.022829 0.0639067 0.0017693 0.1016984 -0.02351 -0.0978377 0.0560313 0.0203191 0.0975294 0.0039585 -0.1328516 -0.0045088 0.1019792 0.0038596 0.0074393 -0.042757 0.0302212 -0.0183947 0.0295362 -0.1260409 -0.0403793 -0.0263563 -0.0398154 0.1310336 0.0429234 0.0456656 -0.0597858 0.0402271 -0.148778 -0.0256436 -0.0663323 -0.036381 -0.0425959 0.0488089 0.0160971 -0.0630133 0.0465057 0.0695806 0.0022915 -0.0072062 0.0106704 -0.0464084 0.0550226 -0.0910013 -0.0563113 -0.0782058 0.0102709 -0.0222996 -0.0583388 -0.0299018 0.1138698 0.0944649 -0.0139486 0.0544732 -0.0089093 0.1290814 0.0486202 0.0310393 0.0330212 -0.0874612 -0.0069573 -0.0188764 -0.0917417 -0.0251844 0.118297 0.0013806 -0.1216807 0.0001788 0.0430061 0.0645163 -0.0594991 -0.0494319 -0.0727681 0.0145421 -0.031976 -0.0583973 -0.02619 0.1526815 0.071731 0.051133 -0.0373844 0.0712341 -0.0932904 0.0294477 -0.0465795 0.0299857 0.1434738 -0.0626817 0.0401661 -0.1028909 0.0463223 0.0778553 0.0217032 -0.1112762 0.0214043 0.1081591 -0.0672784 -0.0265507 -0.0961599 -0.0224175 0.1512585 0.000358 -0.1032033 0.0009034 0.0141424 0.0692213 -0.0147306 0.0117969 -0.0181939 0.1422625 0.0424606 0.0409843 0.0422185 -0.1080667 -0.0928673 -0.0554158 0.070206 -0.060596 0.1444685 0.0281228 0.0763328 0.0284339 0.0605358 unknown
polarizability: 196.2262042|-1.5524374|126.8301627|22.9351865|-14.6028699|115.8913262 unknown
InChI: InChI=1S/C14H10O2/c15-14-13(10-6-2-1-3-7-10)11-8-4-5-9-12(11)16-14/h1-9,13H
charge 0 multiplicity 1
26 atoms
O  1.545757 1.927916 -0.231482
O  -0.413486 2.726586 -1.227177
C  -0.034526 0.233239 -1.008081
C  1.194603 -0.396352 -0.380894
C  -1.390692 -0.145755 -0.408553
C  2.069348 0.629292 0.037615
C  0.258966 1.757819 -0.871017
C  1.561462 -1.738305 -0.180915
C  -2.530595 -0.232837 -1.243806
C  -1.533446 -0.374823 0.983085
C  3.305569 0.390728 0.649564
C  2.808382 -2.01797 0.434437
C  3.666782 -0.96668 0.842179
C  -3.79563 -0.54791 -0.699862
C  -2.797712 -0.688856 1.52734
C  -3.932952 -0.776883 0.688189
H  -0.070089 0.031676 -2.097427
H  0.894026 -2.551096 -0.486309
H  -2.43096 -0.045875 -2.31986
H  -0.656705 -0.313937 1.638292
H  3.954291 1.213771 0.960653
H  3.111732 -3.05737 0.597379
H  4.625646 -1.202765 1.315958
H  -4.670271 -0.612901 -1.356326
H  -2.898135 -0.86305 2.604431
H  -4.913365 -1.020962 1.111889
