program: Gaussian 09
title: 000226649
version: EM64L-G09RevD.01
frameworkgroup: C1[X(C12H15NO4)]
method: RPBEPBE
basis: SDD
operation: Freq
keyword: #p
keyword: freq=noraman
keyword: PBEPBE/SDD
title: #p freq=noraman PBEPBE/SDD
converged: NO YES NO NO
title: Mulliken charges:
elementType: O O O O N C C C C C C C C C C C C H H H H H H H H H H H H H H H
charge: -0.226186 -0.239327 -0.415986 -0.220057 -0.426555 0.321775 -0.525997 -0.507504 -0.480377 0.513462 -0.515822 -0.545322 -0.575207 -0.506881 0.100971 0.169394 0.173098 0.232082 0.236458 0.228629 0.208595 0.251586 0.246793 0.252276 0.261119 0.251556 0.239476 0.336920 0.249947 0.262077 0.265996 0.383008
chargesum: 0.00000
title: Mulliken charges with hydrogens summed into heavy atoms:
elementType: O O O O N C C C C C C C C C C C C
charge: -0.226186 -0.239327 -0.032978 -0.220057 -0.089635 0.321775 -0.057456 -0.070280 0.018002 0.513462 -0.002427 -0.054289 -0.325260 0.021192 0.100971 0.169394 0.173098
polarizability: 1.46731854e+02 1.51989111e+01 1.89670402e+02 1.37136323e+01 5.50901841e-01 1.15267467e+02
1716.lowfreq: -11.6442 -6.3224 0.0007 0.0009 0.0011 9.2010 9.9764 31.0123 59.7404
frequency: -11.1895 30.9801 59.6954 67.7738 89.8401 111.5314 172.0962 182.9479 200.8846 255.0562 264.1581 276.5996 309.9418 380.8784 383.2333 395.6450 442.2461 465.4897 501.0206 505.1913 515.1667 540.4310 570.6603 575.9064 628.0293 641.0870 657.8974 696.9531 719.2465 758.9886 773.4480 774.7122 779.5412 867.5040 882.3182 889.4936 899.8229 936.0545 937.6992 1009.0343 1016.8613 1017.4989 1037.0415 1077.0402 1096.9674 1117.4947 1133.6934 1158.2067 1176.0969 1210.3345 1211.4336 1222.6638 1241.5274 1246.1863 1264.2427 1290.7879 1304.3193 1314.1944 1319.2548 1333.8649 1343.4292 1349.2671 1371.6853 1375.1702 1423.1132 1440.1392 1445.5915 1450.5119 1471.6719 1484.5230 1487.9408 1576.5828 1615.9033 1638.7213 1670.2583 2985.0839 2986.9079 2994.2275 2999.3989 3002.2637 3014.4823 3039.9545 3045.9002 3050.9484 3065.2126 3070.2798 3074.7208 3123.8982 3482.3394 3514.3072
redmass: 10.1873 7.9114 3.3944 5.5166 2.6882 5.5908 3.7847 5.4730 5.9303 3.9154 2.2181 3.4166 2.5038 4.1567 4.3092 3.5929 4.5453 4.6662 2.1388 1.9185 3.1590 2.8681 3.4874 4.6253 4.8544 1.3152 3.7901 3.8027 2.2801 1.5873 1.9677 1.5704 2.7217 3.4058 1.6151 2.6096 2.2447 2.1761 2.2463 2.0911 1.9553 2.0381 2.8653 2.4005 1.9852 1.8758 3.2108 1.2255 1.5258 1.5666 1.6007 1.6000 1.6006 1.5994 2.3401 1.1453 1.7881 1.5098 1.6409 1.7374 1.6544 1.8504 2.7480 1.7785 1.8285 1.0941 1.1033 1.0851 1.0852 1.0873 1.0826 9.3374 7.1881 5.5824 8.2878 1.0657 1.0621 1.0626 1.0629 1.0635 1.0607 1.0998 1.0972 1.0990 1.0960 1.1002 1.0969 1.0914 1.0757 1.0640
irintensity: 0.9322 0.2593 1.1587 3.7022 0.0762 6.1997 4.5154 1.8612 0.9622 8.4575 0.3402 1.1811 4.0345 3.7457 20.4704 5.6972 13.1546 0.1552 14.6823 11.0337 4.7405 10.5627 2.5959 33.2274 1.0664 120.6008 13.0711 0.3579 7.3511 13.5027 47.0024 22.3083 6.7364 3.9341 63.2756 1.2860 18.3952 10.9134 11.8493 0.7007 5.7961 5.8730 232.4866 67.6577 0.6687 9.9409 4.1963 8.3298 112.7184 55.7710 11.5753 24.1339 6.0272 3.0561 234.1774 2.2330 81.4797 44.6738 63.0126 62.9804 9.4735 10.6855 54.6127 37.8442 25.1751 16.8088 10.7864 12.1800 7.2853 17.5138 28.1530 239.0867 290.0635 396.8975 202.3931 8.1206 14.5088 29.8223 13.3397 12.5610 10.7493 16.7060 3.8881 50.4253 24.3472 22.1856 7.4623 8.0684 21.8602 27.2992
temp: 298.150 k
press: 1.00000 atm
elementType: 8 8 8 8 7 6 6 6 6 6 6 6 6 6 6 6 6 1 1 1 1 1 1 1 1 1 1 1 1 1 1 1
symmnumber: 1
zpe: 673098.9 jmol-1
zpe.correction: 0.256370 hartree
zpe.thermalcorrener: 0.271215 hartree
zpe.thermalcorrenthalpy: 0.272159 hartree
zpe.thermalcorrgfe: 0.213797 hartree
zpe.sumelectzpe: -820.676022 hartree
zpe.sumelectthermal: -820.661178 hartree
zpe.sumelectthermalent: -820.660234 hartree
zpe.sumelectthermalfe: -820.718596 hartree
dipole: 3.6024 0.7384 3.9939
dipole: 5.4290
quadrupole: -100.2256 -126.6511 -102.3923
quadrupole: -8.5254 -0.5015 0.0738
quadrupole: 9.5307 -16.8948 7.3640 -8.5254 -0.5015 0.0738
hfenergy: -820.9323923 hartree
pointgroup: C01 [X(C12H15N1O4)]
dipole: 1.3863752 -0.5049434 -1.5444231 debye
polarizability: 143.9281342|-9.8257764|192.8068415|-12.9912885|0.0850243|114.9347469 unknown
InChI: InChI=1S/C12H15NO4/c14-8-1-4-12(6-3-11(16)17)5-2-10(15)13-9(12)7-8/h7,13,16H,1-6H2
charge 0 multiplicity 1
32 atoms
O  -1.978396 -3.552114 0.790995
O  -2.371901 3.544294 0.629048
O  4.733851 -0.013957 -0.17706
O  3.46073 -0.132829 1.762545
N  -1.936167 -1.24238 0.684849
C  -0.264743 0.043202 -0.661592
C  -0.314238 -1.211607 -1.582841
C  -0.318813 1.331362 -1.532311
C  0.992673 0.028411 0.281085
C  -1.50364 0.018639 0.240175
C  -0.384424 -2.526151 -0.780458
C  -0.543951 2.61539 -0.706973
C  -2.16163 1.160488 0.645515
C  2.346324 -0.031497 -0.452793
C  -1.478108 -2.512503 0.281337
C  -1.755746 2.507171 0.227541
C  3.514888 -0.064279 0.516534
H  0.560669 -1.223892 -2.258136
H  -1.206507 -1.133655 -2.23443
H  -1.149298 1.22423 -2.258122
H  0.608241 1.41842 -2.129785
H  0.969613 0.927011 0.923225
H  0.928758 -0.823791 0.982303
H  0.574189 -2.737438 -0.267667
H  -0.579467 -3.393213 -1.434661
H  -0.697033 3.490981 -1.362156
H  0.342434 2.848031 -0.082848
H  -2.701973 -1.273392 1.368574
H  -3.034505 1.105363 1.309248
H  2.431652 -0.930231 -1.093638
H  2.494879 0.832923 -1.125994
H  5.486039 -0.044488 0.474891
