program: Gaussian 09
title: 000226645
version: EM64L-G09RevD.01
frameworkgroup: C1[X(C10H9NO5)]
method: RPBEPBE
basis: SDD
operation: Freq
keyword: #p
keyword: freq=noraman
keyword: PBEPBE/SDD
title: #p freq=noraman PBEPBE/SDD
converged: YES YES NO NO
title: Mulliken charges:
elementType: O O O O O N C C C C C C C C C C H H H H H H H H H
charge: -0.265756 -0.276824 -0.223909 -0.437417 -0.254303 -0.434035 0.446756 0.054077 0.273078 -0.590684 0.337834 -0.393998 -0.481042 0.120877 0.104932 -0.502547 0.277960 0.343012 0.267410 0.243991 0.301557 0.251845 0.236233 0.214276 0.386680
chargesum: 0.00000
title: Mulliken charges with hydrogens summed into heavy atoms:
elementType: O O O O O N C C C C C C C C C C
charge: -0.265756 -0.276824 -0.223909 -0.050737 -0.254303 -0.091023 0.446756 0.054077 0.273078 -0.312725 0.337834 0.117403 -0.179485 0.120877 0.104932 0.199807
polarizability: 2.07934329e+02 1.29662379e+00 1.56116661e+02 -1.11470725e+00 1.76766584e-01 6.18472641e+01
1716.lowfreq: -4.1518 0.0002 0.0003 0.0006 6.1869 7.0422 41.0355 59.8016 80.7035
frequency: 41.0027 59.7997 80.6979 81.6474 130.7972 141.6243 155.2589 194.5801 210.5696 257.0582 303.1657 311.7926 347.0408 353.8270 414.8678 445.4050 473.0266 511.7895 523.0705 554.8161 581.6271 590.1647 612.1831 626.4025 697.0732 704.5688 725.8495 737.6508 745.7262 863.3327 881.3642 896.0707 914.8763 953.2440 972.3523 1003.8487 1051.7031 1082.4283 1109.8526 1117.3580 1158.3086 1182.4722 1206.9678 1215.6783 1268.4137 1332.0052 1337.8560 1351.3385 1368.7767 1406.3082 1442.9481 1446.1355 1451.2333 1456.7284 1466.2879 1498.3035 1593.5549 1616.1171 1639.4729 1650.1361 2979.2272 2988.5001 3098.1922 3131.7310 3132.5125 3153.9302 3194.6559 3525.8739 3533.2845
redmass: 2.9632 8.7927 3.8289 7.3421 3.0263 4.2317 2.7263 2.0597 5.3993 3.9287 4.9119 7.5777 6.9824 7.0419 7.8695 6.3766 3.5030 5.8521 2.5434 3.4634 4.4852 4.4509 1.5587 4.8903 3.3856 2.3076 4.0461 5.4935 3.4684 5.8443 5.0536 1.4508 1.6887 8.1343 6.0161 2.1406 2.6279 3.8240 1.2570 1.7325 1.5443 2.9846 1.1506 1.3713 2.1987 3.5263 1.5321 2.5057 2.9902 4.4878 1.7429 1.3100 2.1872 1.0641 1.0526 3.1731 8.6046 6.9389 8.4025 6.7195 1.0683 1.0328 1.0996 1.0959 1.1053 1.0927 1.0924 1.0769 1.0642
irintensity: 4.0790 1.7099 3.0718 1.9545 3.1636 2.5660 4.7540 0.4415 6.4841 6.5077 0.6715 3.4856 7.7661 2.7005 3.4770 15.6621 6.3482 17.6711 23.4642 29.7726 6.9065 59.0471 103.9386 9.2754 32.7726 21.0619 13.5581 81.5133 12.8024 9.4855 8.7265 3.0143 52.5550 117.3575 35.8954 38.6831 149.2339 143.7426 10.3063 236.3193 34.7603 18.2211 11.5642 13.7534 29.2060 14.0709 18.2369 282.5282 56.1198 30.1455 106.7368 15.8949 101.1631 16.2707 32.4161 67.8542 224.0332 1.7131 318.1686 442.4192 40.3422 63.9031 37.5378 4.7012 18.3497 3.8848 4.0199 35.6194 55.2936
temp: 298.150 k
press: 1.00000 atm
elementType: 8 8 8 8 8 7 6 6 6 6 6 6 6 6 6 6 1 1 1 1 1 1 1 1 1
symmnumber: 1
zpe: 474238.4 jmol-1
zpe.correction: 0.180628 hartree
zpe.thermalcorrener: 0.194973 hartree
zpe.thermalcorrenthalpy: 0.195917 hartree
zpe.thermalcorrgfe: 0.138613 hartree
zpe.sumelectzpe: -816.174474 hartree
zpe.sumelectthermal: -816.160129 hartree
zpe.sumelectthermalent: -816.159185 hartree
zpe.sumelectthermalfe: -816.216490 hartree
dipole: -0.1364 2.6477 1.3846
dipole: 2.9910
quadrupole: -94.5769 -94.3262 -92.3246
quadrupole: -8.7777 -2.9464 3.7919
quadrupole: -0.8344 -0.5836 1.4180 -8.7777 -2.9464 3.7919
hfenergy: -816.3551023 hartree
pointgroup: C01 [X(C10H9N1O5)]
dipole: 0.121877 1.0113533 0.5891312 debye
dipolederiv: -1.4067452 0.1405474 0.1163593 0.1406519 -0.4077334 -0.031774 -0.0847322 0.039504 -0.2593548 -0.3148768 0.3027885 0.0137042 0.2585006 -1.6288082 -0.1250281 0.0414993 0.0454096 -0.319363 -1.3544085 -0.301524 0.0484814 -0.5745328 -0.6496598 -0.0106933 -0.0400997 -0.0436984 -0.3587989 -1.2809227 -0.3272503 0.0295657 -0.539819 -0.4857895 0.0147582 0.0148531 0.0055998 -0.4204544 -0.8367772 0.2728026 0.02145 0.3280058 -1.0655627 -0.0212352 0.0085778 -0.0100053 -0.3320713 -1.520818 -0.4010105 0.0471535 0.1472386 -0.2821662 -0.0309704 0.1852361 0.029658 -0.3422715 0.7311811 0.452345 0.0483802 0.7266307 0.2316653 -0.0208547 -0.0022244 0.0227294 0.0857009 0.9447956 -0.4258342 0.0103731 -0.5096708 -0.1162737 0.0479952 0.1198504 0.0518682 -0.0156218 -0.2576649 0.0701988 0.0732443 -0.1589858 1.5739197 0.0407818 0.0637811 -0.13038 0.0771542 -0.0840158 -0.2545351 -0.0123412 0.1005599 -0.1387509 -0.0067509 -0.0238182 0.0028983 -0.1826112 -0.6754626 0.3568976 0.0318712 0.4253867 -0.0223148 -0.0132389 0.0327063 -0.0079481 0.0141659 0.6812537 0.0541257 -0.1431336 0.2593894 0.0162112 -0.1126906 -0.1763322 -0.1172226 0.402075 0.0276137 0.1826011 0.0026392 -0.2880474 -0.2339455 -0.0139136 -0.0182649 -0.0471145 -0.1524678 2.0677159 0.4229936 -0.1170835 0.0515975 0.6180747 0.133782 -0.1180703 0.1027164 0.2118359 2.2449864 -0.2752214 -0.0714102 -0.2136979 1.3991214 0.0209514 -0.0317628 0.0169841 0.2263965 0.3650726 -0.463373 -0.0760381 -0.1378332 0.6404008 0.0858688 -0.0609634 0.1580847 0.3447424 0.1301666 -0.0157525 -0.0023349 -0.0420017 -0.0020908 -0.0011782 0.0090888 0.0009672 0.1765962 0.1156263 0.0255546 0.0217428 0.0170893 0.1898654 -0.0260083 -0.0085807 -0.0379013 0.3273948 -0.0402158 0.0292373 -0.0108623 0.0101265 0.0748909 0.0278318 -0.036256 0.0384822 0.0967156 0.0350547 -0.0261198 -0.0396063 -0.0717114 0.05435 -0.0012119 0.1292772 -0.0209476 -0.1268659 0.0925691 -0.0497497 -0.0024494 -0.0451527 0.0921316 0.0001152 -0.0043031 -0.0011584 0.1726627 -0.0715149 0.1225989 -0.0603658 -0.0119428 0.1050275 -0.0304383 -0.0801484 -0.0400522 0.0071037 0.0591856 -0.0851061 0.0113588 -0.031077 -0.1677226 -0.0226748 0.0152323 -0.0265494 0.1128955 0.0258084 0.1195001 0.0587761 -0.0055401 0.0278383 0.1025416 0.0647348 -0.028953 -0.1454675 0.3223927 0.0732853 0.0005255 0.1648357 0.1773215 -0.0059648 0.0007193 -0.002971 0.3999089 unknown
polarizability: 206.8437847|-5.8252954|156.5622317|-7.6845552|5.1359023|62.4922381 unknown
InChI: InChI=1S/C10H9NO5/c1-15-7-3-5(10(13)14)2-6-9(7)16-4-8(12)11-6/h2-3,11,13H,4H2,1H3
charge 0 multiplicity 1
25 atoms
O  -1.887743 1.238525 -0.07629
O  0.590653 2.855403 -0.049433
O  -3.999284 -1.739706 0.140075
O  4.331261 -0.361592 -0.092434
O  3.429728 -2.501635 -0.083287
N  -1.682821 -1.54088 -0.061259
C  -0.488306 -0.771121 -0.004675
C  -0.610139 0.648588 0.003242
C  0.558329 1.461592 -0.006726
C  0.774472 -1.384953 -0.022585
C  1.935407 -0.572981 -0.046737
C  -2.975513 0.450488 0.549551
C  1.826315 0.834517 -0.037506
C  -2.953094 -1.035692 0.175568
C  3.251974 -1.258054 -0.074965
C  -0.518217 3.658612 0.503851
H  0.884578 -2.474434 -0.029184
H  -1.614515 -2.543283 -0.259696
H  -3.913346 0.895638 0.189674
H  -2.916973 0.548802 1.653119
H  2.719206 1.462888 -0.045529
H  -1.416455 3.588323 -0.128786
H  -0.126401 4.686919 0.51331
H  -0.761805 3.338239 1.533694
H  5.177788 -0.883102 -0.113293
