program: Gaussian 09
title: 000226632
version: EM64L-G09RevD.01
frameworkgroup: C1[X(C18H17N3O)]
method: RPBEPBE
basis: SDD
operation: Freq
keyword: #p
keyword: freq=noraman
keyword: PBEPBE/SDD
title: #p freq=noraman PBEPBE/SDD
converged: YES YES NO NO
title: Mulliken charges:
elementType: O N N N C C C C C C C C C C C C C C C C C C H H H H H H H H H H H H H H H H H
charge: -0.254380 -0.485006 -0.136467 -0.461965 0.147171 0.347458 0.433738 -0.330800 -0.372544 -0.472222 -0.425113 -0.234398 0.468170 -0.276305 -0.243840 0.293982 -0.639925 -0.381979 -0.350479 -0.222118 -0.213677 -0.265257 0.306277 0.180530 0.238506 0.285694 0.240014 0.228041 0.227837 0.230836 0.295361 0.223979 0.257201 0.232350 0.234611 0.230240 0.219382 0.219617 0.225480
chargesum: 0.00000
title: Mulliken charges with hydrogens summed into heavy atoms:
elementType: O N N N C C C C C C C C C C C C C C C C C C
charge: -0.254380 -0.199312 -0.136467 -0.166605 0.147171 0.347458 0.433738 -0.150270 -0.066266 -0.233716 -0.185098 -0.006357 0.468170 -0.048469 -0.013004 0.293982 0.073605 -0.147368 -0.120239 -0.002737 0.005941 -0.039777
polarizability: 3.27514641e+02 2.61959557e+01 2.04850099e+02 1.11112695e+00 -9.68401897e+00 1.57834433e+02
1716.lowfreq: -10.8534 -3.7118 -0.0006 -0.0002 0.0006 1.4921 12.5858 22.6506 34.3985
frequency: 12.1861 22.4515 34.3692 57.0864 61.7563 86.9981 103.2322 133.4462 158.7368 175.2995 190.3880 235.8393 254.6830 258.4235 273.5885 321.7107 348.8489 380.4180 412.0245 415.6085 422.2989 470.2089 471.5659 506.5436 509.4798 524.7876 530.8613 556.2241 589.0450 613.9468 624.3989 645.0593 692.1480 697.5264 708.2705 734.7374 755.7950 765.7339 772.9622 781.8357 785.4869 805.2069 820.1438 865.6467 866.9962 881.0463 925.2342 948.1845 958.6797 959.6838 977.4354 979.3650 985.4384 993.6475 996.6486 1026.3923 1036.2986 1060.3093 1085.9992 1093.7204 1104.6961 1118.0929 1153.4846 1169.1621 1175.8738 1182.2821 1190.9945 1195.6892 1235.1289 1264.3787 1272.0534 1291.1112 1322.8163 1337.5553 1360.5612 1386.4612 1407.8749 1417.9077 1431.9345 1439.4076 1446.6659 1449.9566 1455.6835 1469.8101 1483.3135 1492.4080 1494.2327 1538.2902 1587.2973 1591.8254 1599.1807 1617.6961 1634.3977 1658.2640 2968.0435 3050.0159 3098.6536 3113.7871 3124.5625 3124.8563 3130.2449 3132.3006 3142.0683 3154.5910 3154.9857 3163.4840 3164.1809 3173.6463 3193.5759 3474.4062 3544.2178
redmass: 4.7406 5.4632 3.8570 5.0759 4.9280 4.3612 3.4236 4.0116 1.7267 4.0760 2.0143 3.2400 3.0725 3.6961 6.3196 1.4405 5.7194 4.5150 2.9197 3.0218 4.1748 3.9120 4.5752 3.0658 6.6215 5.5757 1.5515 5.2182 2.2096 6.3732 6.2384 3.4981 1.9005 6.2201 7.6094 1.3427 1.7775 5.7051 5.1784 2.2532 4.7627 1.3924 1.2556 2.1697 3.5672 1.4779 1.3435 1.4150 6.2438 1.3881 2.3177 1.9207 1.3369 1.3542 4.8768 2.3361 2.5056 2.5263 1.8494 1.9339 1.3051 1.7800 1.4206 1.1433 1.6063 1.1070 1.1159 1.3110 1.9109 3.3186 1.6856 2.6637 1.5860 3.0747 2.3520 7.5493 2.4709 5.4676 1.1937 2.0301 2.3600 1.6777 2.3947 1.0733 1.2472 1.9157 2.3247 2.7679 6.4383 7.3480 5.2942 6.2610 6.4687 4.8335 1.0362 1.1018 1.0868 1.0977 1.0846 1.0874 1.0868 1.0892 1.0933 1.0968 1.0928 1.1002 1.0949 1.0983 1.0944 1.0782 1.0746
irintensity: 0.2635 0.1758 0.7134 0.3021 5.0355 2.5565 2.5226 4.2650 0.2426 2.4085 1.0554 3.8988 2.9091 3.8319 0.3811 50.8514 19.7060 11.7565 0.3865 8.1048 9.2723 6.6000 9.4056 16.3691 2.7629 6.2901 58.8569 8.0855 72.8890 0.7036 4.7929 4.4363 37.1164 4.5250 12.6981 18.9933 80.5045 4.2722 3.3735 62.4725 11.6504 57.8365 0.1787 18.5018 5.0953 6.9600 2.9944 1.8081 23.3656 1.1943 0.8807 0.6286 0.2574 5.2413 5.7012 25.9636 7.8591 4.1872 0.6407 20.4720 33.0893 85.2230 8.7510 31.8007 147.9535 0.5224 6.2557 19.9365 2.4009 96.0181 67.9064 38.5953 11.3404 27.9373 73.0970 21.8749 64.8791 82.1006 28.6127 48.8744 12.9196 46.4577 4.1665 26.5241 18.4649 466.5739 114.0635 397.0992 8.8208 36.2905 16.8897 118.4407 14.0311 102.1983 57.0163 33.6872 30.4189 20.8764 4.2967 0.8574 2.1943 12.3173 30.4458 32.7622 37.2937 29.6016 31.8684 5.5485 6.6715 50.1542 14.4673
temp: 298.150 k
press: 1.00000 atm
elementType: 8 7 7 7 6 6 6 6 6 6 6 6 6 6 6 6 6 6 6 6 6 6 1 1 1 1 1 1 1 1 1 1 1 1 1 1 1 1 1
symmnumber: 1
zpe: 814933.2 jmol-1
zpe.correction: 0.310392 hartree
zpe.thermalcorrener: 0.329564 hartree
zpe.thermalcorrenthalpy: 0.330509 hartree
zpe.thermalcorrgfe: 0.260188 hartree
zpe.sumelectzpe: -934.047180 hartree
zpe.sumelectthermal: -934.028008 hartree
zpe.sumelectthermalent: -934.027063 hartree
zpe.sumelectthermalfe: -934.097384 hartree
dipole: -1.5127 -2.9391 2.0531
dipole: 3.8912
quadrupole: -117.5980 -123.8291 -124.7169
quadrupole: 3.5684 6.4690 -2.6079
quadrupole: 4.4500 -1.7811 -2.6689 3.5684 6.4690 -2.6079
hfenergy: -934.3575721 hartree
pointgroup: C01 [X(C18H17N3O1)]
dipole: -0.5969941 1.0749509 -0.9120476 debye
polarizability: 327.1526157|-27.1937927|202.8586161|-0.3220549|-13.8520143|160.1879418 unknown
InChI: InChI=1S/C18H17N3O/c1-21(15-10-3-2-4-11-15)20-18(22)19-17-13-7-9-14-8-5-6-12-16(14)17/h2-13,19-20H,1H3
charge 0 multiplicity 1
39 atoms
O  0.955096 -1.652442 -0.232802
N  -0.644582 0.085545 -0.486172
N  2.881754 0.008639 -1.418182
N  1.545783 0.373354 -1.24796
C  -3.058204 0.263199 -0.048831
C  -1.82943 -0.508049 0.028425
C  -4.272559 -0.319579 0.490119
C  -3.142324 1.573255 -0.631458
C  -1.83406 -1.790758 0.600721
C  -4.241254 -1.630352 1.067907
C  -5.494539 0.429936 0.431663
C  -3.04371 -2.34328 1.113519
C  3.783827 0.234774 -0.342267
C  -4.347847 2.279144 -0.674788
C  -5.539136 1.703963 -0.135127
C  0.627378 -0.495466 -0.61117
C  3.16401 -1.007414 -2.450138
C  5.097262 -0.315079 -0.380126
C  3.414398 1.048966 0.766162
C  6.010866 -0.043614 0.660297
C  4.338236 1.308312 1.79798
C  5.645931 0.770322 1.756057
H  -0.901268 -2.354767 0.648942
H  -2.262094 2.058491 -1.072903
H  -5.167063 -2.057519 1.469169
H  -0.73585 1.054139 -0.793878
H  -6.402952 -0.024384 0.844934
H  -3.015095 -3.345732 1.553935
H  -4.381527 3.276025 -1.127442
H  -6.479822 2.263524 -0.171933
H  1.261821 1.278645 -1.632965
H  4.091126 -0.754793 -2.99689
H  3.256084 -2.021545 -2.015138
H  2.329686 -1.008591 -3.168094
H  5.40702 -0.959413 -1.20732
H  2.40272 1.461178 0.823518
H  7.015509 -0.479729 0.612668
H  4.029782 1.932638 2.644647
H  6.359028 0.974258 2.561419
