program: Gaussian 09
title: 000226622
version: EM64L-G09RevD.01
frameworkgroup: C1[X(C11H21NO)]
method: RPBEPBE
basis: SDD
operation: Freq
keyword: #p
keyword: freq=noraman
keyword: PBEPBE/SDD
title: #p freq=noraman PBEPBE/SDD
converged: YES YES NO NO
title: Mulliken charges:
elementType: O N C C C C C C C C C C C H H H H H H H H H H H H H H H H H H H H H
charge: -0.438291 -0.182938 0.475141 -0.549784 -0.466743 -0.499907 -0.490649 -0.382365 -0.407856 -0.391220 -0.387949 -0.364024 -0.357941 0.218418 0.228630 0.208511 0.204134 0.185172 0.219766 0.226308 0.220661 0.214600 0.187547 0.197004 0.195277 0.192938 0.208279 0.187289 0.202719 0.189660 0.200681 0.226205 0.200516 0.330212
chargesum: 0.00000
title: Mulliken charges with hydrogens summed into heavy atoms:
elementType: O N C C C C C C C C C C C
charge: -0.108079 -0.182938 0.475141 -0.102737 -0.054098 -0.094969 -0.043680 0.019782 -0.015575 0.009998 0.002059 0.026317 0.068780
polarizability: 1.37414605e+02 3.36688805e+00 1.24671355e+02 1.23660194e+00 5.76839739e-02 1.07368053e+02
1716.lowfreq: -16.4372 -0.0010 -0.0009 -0.0006 1.8701 13.2713 60.1798 63.3816 80.2206
frequency: 59.7643 63.0072 80.1727 98.7275 135.5395 141.1014 210.2943 239.0058 266.7914 285.5419 305.4274 329.1228 345.5997 382.6625 432.5601 439.7475 465.7830 528.3731 591.4358 642.5626 696.1623 774.9162 802.5469 806.9623 825.1738 840.6890 857.3240 904.6593 913.3620 924.0764 931.4424 950.9618 970.3231 992.0928 1029.6230 1043.9405 1049.4760 1058.2183 1066.9719 1076.7491 1097.2049 1102.3840 1133.3638 1157.3634 1163.5785 1188.4793 1199.2186 1206.2302 1211.2458 1237.3759 1251.3089 1267.2604 1281.8779 1285.2569 1290.4818 1303.9588 1315.9647 1320.9059 1331.2084 1336.1566 1337.6714 1351.4590 1352.6995 1358.9931 1384.3622 1453.7959 1458.5365 1460.7224 1461.6908 1470.9108 1471.4576 1479.3263 1480.2769 1486.2434 1506.4387 2870.0642 2878.2856 2959.5933 2962.6635 2964.7303 2972.2301 2973.3983 2977.6701 2989.4546 3003.8220 3005.6669 3013.8444 3017.2585 3024.4957 3028.3282 3033.6507 3043.1886 3067.0682 3083.9295 3085.5444 3559.3834
redmass: 2.9701 2.4629 2.9228 2.1595 2.5109 2.6186 2.3661 2.2774 3.6748 2.2671 1.3078 2.1770 2.2401 2.3246 2.6303 3.2160 2.0497 2.6305 2.4924 3.3901 2.7636 1.4926 1.6377 1.2023 2.6509 1.6538 1.6609 2.2592 1.7815 1.6733 2.0571 2.8034 2.2507 2.5767 1.8821 2.0809 2.6812 1.8051 2.0513 1.1730 1.7328 1.8075 1.7241 1.4131 2.5286 2.2860 1.4996 1.4976 1.5384 1.4957 1.3086 1.2462 1.4866 1.1726 1.2692 1.2637 1.5587 1.6153 1.4022 1.3991 1.4463 1.4658 1.4729 1.3096 1.2690 1.0853 1.0874 1.0892 1.0821 1.0830 1.0875 1.0870 1.0879 1.0873 1.0874 1.0682 1.0719 1.0623 1.0625 1.0600 1.0633 1.0621 1.0669 1.0896 1.0879 1.0615 1.0666 1.0964 1.0971 1.0998 1.0996 1.1022 1.0997 1.1034 1.0989 1.0662
irintensity: 0.3502 1.7580 2.4781 4.3128 1.0964 0.4732 0.4227 1.6959 3.1574 10.8539 100.5324 34.3140 16.8500 13.5833 3.6484 2.6454 2.8977 2.6471 4.0597 4.3409 1.3186 2.2568 2.5166 3.6521 0.6873 7.1059 4.2033 7.3614 11.4775 3.2974 0.8289 47.7883 45.7610 22.6238 8.3385 3.7977 5.3160 1.0145 6.1236 0.5737 58.0898 17.0418 1.6995 15.1813 7.8742 13.9922 19.1215 4.5531 9.6605 2.5206 3.8874 0.5246 0.3447 0.6349 5.5870 0.8446 12.1827 5.0898 0.1103 4.2797 0.4769 1.8954 5.1912 16.8796 4.1945 0.5161 7.2941 8.0523 2.2010 24.8145 0.7569 4.6371 7.8035 5.5742 2.8274 62.5714 96.9475 14.4324 35.1997 57.3402 28.6235 28.9564 54.9090 52.1508 16.3078 31.6375 27.4825 78.3824 82.6439 23.1798 16.4239 119.3500 26.4076 55.4369 38.2548 6.5657
temp: 298.150 k
press: 1.00000 atm
elementType: 8 7 6 6 6 6 6 6 6 6 6 6 6 1 1 1 1 1 1 1 1 1 1 1 1 1 1 1 1 1 1 1 1 1
symmnumber: 1
zpe: 803104.4 jmol-1
zpe.correction: 0.305886 hartree
zpe.thermalcorrener: 0.319395 hartree
zpe.thermalcorrenthalpy: 0.320339 hartree
zpe.thermalcorrgfe: 0.265981 hartree
zpe.sumelectzpe: -560.655792 hartree
zpe.sumelectthermal: -560.642284 hartree
zpe.sumelectthermalent: -560.641340 hartree
zpe.sumelectthermalfe: -560.695697 hartree
dipole: -2.4827 -0.1163 -0.1789
dipole: 2.4919
quadrupole: -95.4458 -75.0234 -82.7228
quadrupole: 0.8785 -2.8812 1.2039
quadrupole: -11.0485 9.3740 1.6745 0.8785 -2.8812 1.2039
hfenergy: -560.9616786 hartree
pointgroup: C01 [X(C11H21N1O1)]
dipole: -0.9788473 0.0056296 -0.0543604 debye
polarizability: 137.7400592|2.6697411|124.27165|0.970279|1.3421383|107.4423036 unknown
InChI: InChI=1S/C11H21NO/c13-10-9-12-8-4-7-11(12)5-2-1-3-6-11/h13H,1-10H2
charge 0 multiplicity 1
34 atoms
O  4.064569 -1.791129 0.08599
N  0.991422 0.416253 -0.204763
C  -0.507964 0.285568 -0.145007
C  -0.928975 1.741923 -0.491885
C  -1.027538 -0.145415 1.268203
C  -0.999526 -0.732621 -1.206444
C  0.119639 2.639036 0.218037
C  1.400108 1.758793 0.296135
C  -2.55867 -0.379603 1.312907
C  -2.534509 -0.931514 -1.175212
C  -3.009053 -1.383868 0.226091
C  1.823022 -0.698295 0.273206
C  3.197247 -0.71925 -0.432105
H  -1.959648 1.974769 -0.176058
H  -0.869678 1.877089 -1.587699
H  -0.73696 0.611586 2.023585
H  -0.520455 -1.089923 1.553991
H  -0.51938 -1.716723 -1.023035
H  -0.661501 -0.392067 -2.203356
H  0.293416 3.579485 -0.332012
H  -0.22395 2.910743 1.232295
H  2.21931 2.169608 -0.325032
H  1.781732 1.705556 1.344736
H  -3.09219 0.581155 1.163307
H  -2.850448 -0.745674 2.317052
H  -2.830057 -1.67702 -1.939059
H  -3.039945 0.017376 -1.446514
H  -2.577075 -2.381775 0.449762
H  -4.110249 -1.499284 0.242719
H  1.30445 -1.653418 0.055817
H  2.00502 -0.666403 1.376451
H  3.75967 0.205484 -0.22324
H  3.049059 -0.801669 -1.528788
H  3.652109 -2.666769 -0.124878
