program: Gaussian 09
title: 000021355
version: EM64L-G09RevD.01
frameworkgroup: C1[X(C9H19Cl3Si)]
method: RPBEPBE
basis: SDD
operation: Freq
keyword: #p
keyword: freq=noraman
keyword: PBEPBE/SDD
title: #p freq=noraman PBEPBE/SDD
converged: YES YES NO NO
title: Mulliken charges:
elementType: Cl Cl Cl Si C C C C C C C C C H H H H H H H H H H H H H H H H H H H
charge: -0.241137 -0.241634 -0.241479 0.810611 -0.384372 -0.381936 -0.364649 -0.372195 -0.306893 -0.353983 -0.842919 -0.356230 -0.695880 0.196943 0.197120 0.193642 0.193554 0.197073 0.197190 0.191082 0.191017 0.220766 0.220374 0.188373 0.188348 0.285189 0.285179 0.195444 0.195361 0.216362 0.209846 0.209832
chargesum: 0.00000
title: Mulliken charges with hydrogens summed into heavy atoms:
elementType: Cl Cl Cl Si C C C C C C C C C
charge: -0.241137 -0.241634 -0.241479 0.810611 0.009691 0.005260 0.029614 0.009904 0.134248 0.022738 -0.272551 0.034574 -0.059840
polarizability: 1.89985285e+02 -7.30822838e+00 1.32998977e+02 4.02247864e-01 5.89940729e-03 1.31253965e+02
1716.lowfreq: -1.9297 -0.0015 0.0023 0.0026 4.3477 8.3098 19.8444 31.8084 41.2285
frequency: 19.5965 31.6970 40.3133 51.0827 67.9752 74.6487 96.1297 115.2136 117.8023 133.3169 133.9223 149.5277 152.8584 162.4025 205.7338 219.1450 226.2321 242.0252 315.8478 352.5419 409.0628 457.1571 480.7980 496.6553 526.5373 723.3245 729.0996 737.8112 754.9314 759.5625 807.5230 870.0779 888.5027 941.3906 983.8662 995.7069 1007.6025 1038.0348 1045.3566 1066.4191 1067.6093 1078.6559 1081.6187 1119.2046 1184.1948 1208.3895 1214.0889 1241.3792 1248.8847 1273.7088 1279.3104 1283.1096 1293.9522 1297.8550 1307.3108 1308.8921 1339.4337 1353.1404 1357.7946 1358.0399 1388.2719 1406.2028 1462.3357 1462.5656 1466.2893 1469.2071 1474.9503 1476.1110 1480.9808 1486.5203 1489.6230 2950.6573 2951.7837 2955.9723 2958.6164 2965.2184 2968.9239 2971.6422 2981.0604 2984.7606 2992.0253 2994.9641 3000.7540 3012.6027 3025.9833 3036.9100 3045.8170 3064.2453 3067.8605 3071.3079
redmass: 5.9019 5.5474 2.3035 2.6624 5.9668 1.8709 2.5560 9.5210 1.8136 4.8209 4.9810 2.7585 1.9506 8.7851 3.1972 9.6796 1.1304 3.7089 5.5384 3.4425 6.4096 3.3784 3.2622 13.8065 15.8698 1.0621 1.0733 1.1142 5.3780 1.1879 1.2357 1.2597 1.8967 1.2353 4.7142 4.8761 1.1493 3.4913 3.2292 2.6678 1.1103 2.2819 2.2331 2.5591 1.8261 1.2523 1.4938 1.3042 1.3238 1.3035 1.1906 1.0412 1.0666 1.1221 1.0959 1.3246 1.3870 1.5028 1.5995 1.6139 1.2176 1.0795 1.0735 1.0723 1.0662 1.0752 1.0757 1.0426 1.0832 1.0902 1.0955 1.0589 1.0589 1.0592 1.0592 1.0590 1.0587 1.0364 1.0593 1.0968 1.0986 1.0576 1.1009 1.1031 1.1042 1.1044 1.1043 1.1028 1.1007 1.0993
irintensity: 0.6485 0.6422 0.0554 0.2396 0.5004 0.0078 0.0162 2.2205 0.0556 1.1366 2.1917 0.6712 0.0607 3.0975 1.9229 11.2764 0.0004 0.6651 2.8885 1.3503 36.6164 4.3982 11.5173 98.9634 134.0426 11.8527 2.5771 25.0249 39.4893 6.7727 12.7974 3.0730 4.3826 7.5722 7.5360 2.5708 1.8294 0.2606 1.7369 0.4435 11.5351 0.0315 0.5006 26.5863 0.0369 28.6112 1.1686 4.2153 0.6836 1.1231 0.0276 0.6837 0.2651 0.2349 0.0062 0.7341 1.2946 0.0964 0.2814 1.3504 11.0156 8.3547 0.1803 0.0531 0.9533 0.0058 2.6805 12.5147 1.1690 2.5123 33.8168 0.0807 0.4056 3.6345 1.6779 14.3255 168.5026 38.3188 33.6669 0.0427 0.0854 15.9228 0.2789 0.8459 0.8885 40.2901 123.1526 27.6287 101.2899 53.8529
temp: 298.150 k
press: 1.00000 atm
elementType: 17 17 17 14 6 6 6 6 6 6 6 6 6 1 1 1 1 1 1 1 1 1 1 1 1 1 1 1 1 1 1 1
symmnumber: 1
zpe: 697352.1 jmol-1
zpe.correction: 0.265607 hartree
zpe.thermalcorrener: 0.284266 hartree
zpe.thermalcorrenthalpy: 0.285211 hartree
zpe.thermalcorrgfe: 0.214579 hartree
zpe.sumelectzpe: -2022.967185 hartree
zpe.sumelectthermal: -2022.948526 hartree
zpe.sumelectthermalent: -2022.947582 hartree
zpe.sumelectthermalfe: -2023.018214 hartree
dipole: 3.9658 1.3643 -0.0753
dipole: 4.1946
quadrupole: -131.1760 -113.7206 -113.4478
quadrupole: -2.7750 0.1303 -0.0244
quadrupole: -11.7279 5.7275 6.0004 -2.7750 0.1303 -0.0244
hfenergy: -2023.2327928 hartree
pointgroup: C01 [X(C9H19Cl3Si1)]
dipole: 1.5567774 0.5470696 -0.0240564 debye
polarizability: 190.0769933|-6.9502933|132.9075225|0.1674102|0.0496211|131.2537114 unknown
InChI: InChI=1S/C9H19Cl3Si/c1-2-3-4-5-6-7-8-9-13(10,11)12/h2-9H2,1H3
charge 0 multiplicity 1
32 atoms
Cl -6.177059 1.424671 -0.026894
Cl -4.760407 -1.344268 -1.706135
Cl -4.747293 -1.227734 1.821279
Si -4.548699 -0.022737 0.015089
C  0.914908 -0.257646 -0.002209
C  2.256972 0.508509 -0.012408
C  -0.317003 0.675326 -0.014859
C  3.488429 -0.424941 0.001197
C  -1.652917 -0.104802 0.002119
C  4.833916 0.33474 -0.004689
C  -2.873819 0.848954 -0.019172
C  6.063507 -0.602003 0.002408
C  7.404844 0.162546 0.000776
H  0.873065 -0.909908 0.894771
H  0.872824 -0.933412 -0.881555
H  2.30143 1.16029 -0.909988
H  2.300446 1.185671 0.866258
H  -0.278987 1.323183 -0.915109
H  -0.274441 1.353078 0.862889
H  3.442095 -1.07979 0.896666
H  3.44602 -1.100442 -0.87897
H  -1.690634 -0.784452 -0.872449
H  -1.690132 -0.744916 0.906109
H  4.881355 1.006511 0.878138
H  4.881342 0.992959 -0.897697
H  -2.848625 1.532879 0.851903
H  -2.857617 1.482003 -0.928091
H  6.016347 -1.270835 -0.881361
H  6.013367 -1.261593 0.892975
H  8.266569 -0.529975 0.00708
H  7.494011 0.80484 -0.895806
H  7.489685 0.815793 0.889838
