program: Gaussian 09
title: 000226601
version: EM64L-G09RevD.01
frameworkgroup: C1[X(C11H13NO3)]
method: RPBEPBE
basis: SDD
operation: Freq
keyword: #p
keyword: freq=noraman
keyword: PBEPBE/SDD
title: #p freq=noraman PBEPBE/SDD
converged: YES YES NO NO
title: Mulliken charges:
elementType: O O O N C C C C C C C C C C C H H H H H H H H H H H H H
charge: -0.427797 -0.254201 -0.248055 -0.459371 0.427279 0.410622 0.012852 0.545468 -0.588294 -0.717580 -0.797344 -0.800960 0.061372 0.223474 -0.780936 0.315721 0.228441 0.257316 0.231681 0.226470 0.214044 0.236164 0.263618 0.307174 0.260828 0.260680 0.213725 0.377611
chargesum: 0.00000
title: Mulliken charges with hydrogens summed into heavy atoms:
elementType: O O O N C C C C C C C C C C C
charge: -0.050186 -0.254201 -0.248055 -0.152197 0.427279 0.410622 0.012852 0.545468 -0.272574 -0.489140 -0.081877 -0.087134 0.061372 0.223474 -0.045704
polarizability: 2.25951138e+02 1.46730120e+00 1.48378313e+02 -1.13888730e+00 -1.00310185e+00 7.19823642e+01
1716.lowfreq: -9.8337 -0.7298 -0.0008 -0.0005 0.0003 7.7667 34.3615 49.9062 51.8829
frequency: 34.3434 49.8997 51.8813 61.2232 104.5181 120.8799 175.0955 179.4928 209.1744 226.8944 236.2892 267.1263 287.3972 300.1408 324.1405 391.9361 414.8841 516.3071 531.7578 534.9282 541.9081 551.4884 581.4450 595.1363 628.1618 665.8327 667.5662 701.4497 741.6062 779.8922 871.3577 901.0106 930.5522 964.7953 977.6637 992.3665 998.4452 1040.0762 1046.4763 1049.7415 1051.0905 1056.2341 1137.8602 1193.9631 1234.5439 1254.2741 1301.1412 1317.4378 1370.7962 1387.4489 1395.5956 1404.5404 1412.5650 1443.0099 1448.5760 1458.8865 1464.7002 1469.6732 1474.4770 1487.2031 1505.4351 1583.5372 1615.8241 1624.1919 1630.5486 2993.5356 2996.1408 2998.5523 3081.0212 3085.3071 3091.4835 3098.2794 3099.0850 3099.0932 3111.0154 3191.3141 3504.3416 3531.6971
redmass: 1.2053 10.6152 3.6326 4.1215 3.3299 4.8469 1.1076 1.1325 3.1486 2.5753 5.4321 4.9827 4.5138 4.6602 3.0171 4.4171 4.4121 4.4321 3.3775 3.8498 4.1737 3.2132 3.1400 1.7179 1.9111 1.4708 3.6500 3.2488 4.9261 4.3821 1.5254 4.8249 1.3781 2.5527 4.1476 2.2111 2.4415 1.6361 1.6003 1.7477 1.6484 1.7818 2.5108 1.5265 2.3341 1.4989 2.5631 4.7386 7.2011 1.3755 1.7331 1.2168 1.4385 1.7623 1.0451 1.0855 1.0951 1.0958 1.1294 1.5307 2.3861 5.5992 5.2828 7.2856 5.3379 1.0367 1.0363 1.0364 1.0970 1.0968 1.1003 1.1007 1.1005 1.0984 1.0914 1.0929 1.0637 1.0764
irintensity: 0.7658 7.4940 0.0909 5.8494 1.0361 5.2713 1.2257 1.3386 5.8843 0.3866 0.6978 0.1235 0.7261 3.6312 2.2362 10.3746 10.9032 2.4384 5.8174 2.4794 14.5923 22.9570 21.0800 47.7858 7.9802 85.6372 27.4234 45.7394 1.5024 1.1477 24.9068 4.4413 28.6227 6.8033 37.3351 98.3190 130.8512 12.2169 10.0523 1.4953 12.3410 30.9939 148.5094 17.7022 151.0192 11.0691 63.3070 33.7481 109.5723 151.7920 75.6164 34.9934 11.7884 23.0007 15.3681 19.4162 16.2114 15.5148 75.4850 2.9279 397.2649 67.9185 378.0106 203.9689 78.6763 23.7434 12.8348 16.6582 12.9502 12.7873 14.4141 17.4419 15.8568 9.5287 22.7591 5.1786 38.3442 12.3316
temp: 298.150 k
press: 1.00000 atm
elementType: 8 8 8 7 6 6 6 6 6 6 6 6 6 6 6 1 1 1 1 1 1 1 1 1 1 1 1 1
symmnumber: 1
zpe: 579289.9 jmol-1
zpe.correction: 0.220640 hartree
zpe.thermalcorrener: 0.236006 hartree
zpe.thermalcorrenthalpy: 0.236950 hartree
zpe.thermalcorrgfe: 0.177133 hartree
zpe.sumelectzpe: -706.325018 hartree
zpe.sumelectthermal: -706.309652 hartree
zpe.sumelectthermalent: -706.308708 hartree
zpe.sumelectthermalfe: -706.368525 hartree
dipole: -1.9495 2.7404 0.7203
dipole: 3.4394
quadrupole: -80.0546 -83.8800 -91.2573
quadrupole: -19.9967 2.9472 1.8665
quadrupole: 5.0094 1.1839 -6.1933 -19.9967 2.9472 1.8665
hfenergy: -706.5456583 hartree
pointgroup: C01 [X(C11H13N1O3)]
dipole: 0.7577142 -1.1119415 0.1431965 debye
polarizability: 225.9766661|0.6506968|146.9124878|0.8311339|10.4538354|73.4226605 unknown
InChI: InChI=1S/C11H13NO3/c1-6-4-9(12-8(3)13)5-7(2)10(6)11(14)15/h4-5,12,14H,1-3H3
charge 0 multiplicity 1
28 atoms
O  -3.559484 1.25018 0.789257
O  -3.949407 -0.581511 -0.55454
O  3.539894 1.387351 0.145419
N  2.570224 -0.747128 -0.023408
C  -0.72787 1.093843 0.116333
C  -1.112815 -1.355731 -0.088344
C  -1.630762 -0.019119 0.030471
C  1.180592 -0.451389 -0.003984
C  0.666569 0.864009 0.090276
C  0.282006 -1.544935 -0.090338
C  -1.180495 2.542597 0.203939
C  -1.999321 -2.585173 -0.191524
C  -3.10863 0.154475 0.025449
C  3.65814 0.131935 0.047539
C  5.02597 -0.546028 -0.003269
H  1.363164 1.702032 0.142393
H  0.675074 -2.567439 -0.163012
H  -1.63368 2.758143 1.186422
H  -0.320802 3.216758 0.055838
H  -1.949857 2.784271 -0.549413
H  -1.39248 -3.503957 -0.118205
H  -2.767907 -2.609835 0.600907
H  -2.553195 -2.597444 -1.14552
H  2.801621 -1.740065 -0.101208
H  5.591517 -0.277005 0.905397
H  5.589165 -0.149642 -0.865638
H  4.982909 -1.646253 -0.082242
H  -4.552638 1.278059 0.715205
