program: Gaussian 09
title: 000226600
version: EM64L-G09RevD.01
frameworkgroup: C1[X(C7H12O4)]
method: RPBEPBE
basis: SDD
operation: Freq
keyword: #pfreq=noraman
keyword: PBEPBE/SDD
title: #p freq=noraman PBEPBE/SDD
converged: YES YES NO NO
title: Mulliken charges:
elementType: O O O O C C C C C C C H H H H H H H H H H H H
charge: -0.271317 -0.280185 -0.138714 -0.129130 -0.053837 -0.271082 -0.278426 -0.698751 0.156922 -0.130870 -0.492609 0.203061 0.248829 0.196515 0.207365 0.198853 0.251076 0.210826 0.252578 0.176502 0.235157 0.205587 0.201650
chargesum: 0.00000
title: Mulliken charges with hydrogens summed into heavy atoms:
elementType: O O O O C C C C C C C
charge: -0.271317 -0.280185 -0.138714 -0.129130 0.149224 0.174262 0.127791 0.015729 0.156922 0.045632 0.149785
polarizability: 1.17591900e+02 2.27701723e+00 8.44178041e+01 3.89593907e+00 -5.13005911e+00 6.96795071e+01
1716.lowfreq: -4.4158 -1.3466 -0.0010 -0.0008 -0.0006 6.5058 27.5886 37.0658 52.8556
frequency: 26.8857 37.0332 52.8347 89.2480 92.0616 104.9483 143.0096 185.2677 196.8476 213.0288 224.8975 259.7422 289.4281 312.9128 369.4701 480.7085 490.4966 576.5880 668.8239 822.6400 838.4703 845.7943 903.2903 911.9326 978.4503 995.2909 1042.9117 1066.9499 1088.4087 1098.4736 1106.0525 1121.9429 1150.0229 1166.6221 1175.0567 1252.4882 1261.6361 1304.3019 1340.1437 1377.5173 1388.4773 1399.6797 1440.0124 1457.4978 1459.1438 1469.9216 1476.3882 1484.5241 1493.8664 1607.0255 1650.0692 2864.7370 2878.2422 2926.1369 2941.3465 2961.3615 2994.3813 2999.9259 3001.5422 3058.1161 3099.8582 3105.1266 3114.5330
redmass: 2.4560 7.2683 3.0070 2.9909 3.4092 3.1941 2.8328 2.9140 1.3471 2.9135 1.2610 3.0134 5.1563 9.3310 4.0484 3.7341 4.2932 3.4233 3.8040 3.4028 1.2132 3.3523 1.7716 3.5316 4.0112 3.0437 2.1810 4.1682 3.9309 1.3514 3.2948 1.3428 1.8527 1.4951 1.3399 1.3722 1.1537 1.2808 1.2955 1.2186 1.1940 1.4122 1.1629 1.0460 1.0510 1.0630 1.0524 1.0769 1.0812 11.5757 8.9536 1.0823 1.0833 1.0361 1.0533 1.0640 1.1030 1.0350 1.1031 1.1025 1.0992 1.0973 1.1015
irintensity: 2.9711 1.9670 2.4584 9.7634 2.8661 6.1059 5.6434 5.6883 0.3113 2.1719 6.8345 5.0652 1.2590 2.1093 1.0178 0.1892 6.1881 2.3171 12.6692 30.2835 0.5307 15.9803 4.6043 8.9078 58.4920 26.8638 22.9142 152.9246 1.1507 1.2591 84.6596 1.1981 13.0087 11.2122 21.1988 1.0490 1.9526 14.9271 0.8690 2.4263 12.3068 6.6361 0.0914 11.7850 12.9155 13.6977 9.1230 1.5357 6.6083 122.4903 26.2955 29.5058 115.3687 73.6408 61.0909 44.5937 70.0748 15.7314 55.7783 38.4363 22.1776 30.9978 11.4214
temp: 298.150 k
press: 1.00000 atm
elementType: 8 8 8 8 6 6 6 6 6 6 6 1 1 1 1 1 1 1 1 1 1 1 1
symmnumber: 1
zpe: 478114.7 jmol-1
zpe.correction: 0.182104 hartree
zpe.thermalcorrener: 0.195752 hartree
zpe.thermalcorrenthalpy: 0.196697 hartree
zpe.thermalcorrgfe: 0.139717 hartree
zpe.sumelectzpe: -573.870831 hartree
zpe.sumelectthermal: -573.857183 hartree
zpe.sumelectthermalent: -573.856239 hartree
zpe.sumelectthermalfe: -573.913219 hartree
dipole: 1.7449 3.9690 -2.1200
dipole: 4.8261
quadrupole: -63.1562 -70.7022 -65.7274
quadrupole: -9.4338 7.1657 0.7552
quadrupole: 3.3724 -4.1736 0.8012 -9.4338 7.1657 0.7552
hfenergy: -574.0529353 hartree
pointgroup: C01 [X(C7H12O4)]
dipole: -0.7042907 1.5014527 0.9245964 debye
dipolederiv: -1.1964035 -0.1668595 0.0099005 -0.2246173 -0.4682003 -0.0157754 -0.1365469 0.0403098 -0.3553402 -1.1148884 -0.139699 -0.0315942 -0.1888886 -0.4540219 -0.0247841 -0.0077634 -0.0076475 -0.4301294 -0.4068903 -0.0009183 -0.1179266 0.0788729 -0.5256148 -0.1698682 -0.050577 -0.2511572 -0.4656568 -0.713409 0.2265899 -0.0234305 0.2577538 -0.4625174 -0.0380162 0.047617 -0.0779138 -0.3414756 0.7088415 0.1271144 0.041188 -0.0085836 -0.0734223 -0.1121277 0.3298248 -0.1254004 0.3056006 0.561492 0.1402718 -0.0705112 0.3392095 0.3561203 -0.0069026 -0.1430249 -0.0208177 0.3533685 0.5378482 0.1387616 -0.0663894 0.2582005 0.4549543 0.0484558 -0.1220575 0.0182388 0.3974151 -0.0568041 0.0444448 0.0553708 -0.068331 -0.0114838 0.0070328 0.0088198 -0.0338125 0.0427108 0.3201245 -0.2390474 0.0809568 -0.2516649 0.6672169 0.2561617 -0.0721895 0.3291286 0.3334778 0.7442992 -0.2454898 0.0894013 -0.1122246 0.4660707 0.2530409 0.0922182 0.2512495 0.5169488 0.7537147 0.0101386 0.0566208 -0.1387642 0.2583518 0.0470645 0.1542761 0.0721029 0.3576809 -0.0334648 -0.0006367 0.0046445 0.0592471 0.0376104 0.0588688 -0.0787522 0.0402329 -0.1736612 0.022109 0.0484191 0.03131 -0.0061677 -0.0963456 -0.027939 0.0354245 -0.065854 0.03503 -0.0122737 -0.0193169 -0.0464945 -0.0523813 0.0263542 0.0124374 0.0288214 0.0587546 -0.1868475 0.0084433 -0.0201012 -0.0320748 -0.050693 0.0204431 0.0094514 0.0228266 0.0644259 -0.19326 -0.0203744 0.053035 0.0374992 -0.010243 -0.1814204 -0.0595435 0.0443798 -0.0982736 0.0084287 0.0737129 0.0817212 0.0440065 0.058698 -0.0616146 -0.0582768 0.0459887 -0.0338999 0.0768118 -0.1368748 -0.0137659 -0.0669765 0.0008387 0.1098825 0.034809 -0.0885067 0.0006084 0.0647488 0.1093495 0.0024153 -0.0068532 -0.009328 0.0674337 -0.0184129 0.0178452 0.0442079 -0.0872076 -0.0037989 0.0281463 -0.0277141 -0.0449263 -0.0473376 -0.1818491 -0.0642312 -0.159449 -0.1380654 -0.0534485 -0.0943333 0.027502 -0.1308994 -0.0333611 0.0642354 0.0466023 0.0696498 0.0810473 -0.0255313 -0.0045532 0.0057378 0.0554509 0.0850225 0.0218302 -0.1221958 -0.0103905 -0.2245455 -0.0657729 0.0436632 0.0058266 0.1894414 -0.1341207 -0.0998924 0.0112007 -0.104293 0.0229198 unknown
polarizability: 117.4210457|-2.6767765|83.6550806|4.6739369|6.0295835|70.6130851 unknown
InChI: InChI=1S/C7H12O4/c1-6(7(9)5-8)11-4-3-10-2/h5-6H,3-4H2,1-2H3
charge 0 multiplicity 1
23 atoms
O  -0.286191 1.00813 -0.12598
O  -3.503745 -0.700871 0.291391
O  1.434483 -1.07491 -1.060826
O  4.008698 -1.44875 0.197032
C  1.061684 0.893148 0.393567
C  -1.19717 -0.083138 0.275915
C  -2.59369 0.351395 -0.165665
C  1.796628 2.19331 0.000161
C  1.833907 -0.329623 -0.136651
C  3.186305 -0.590494 0.578802
C  -4.883529 -0.455897 -0.120512
H  1.038624 0.805895 1.509406
H  -0.912499 -1.029758 -0.217861
H  -1.173048 -0.219507 1.378156
H  -2.628703 0.456893 -1.271227
H  -2.856065 1.330292 0.290991
H  1.242147 3.053565 0.409783
H  2.829326 2.220495 0.391139
H  1.828135 2.286795 -1.098181
H  3.381239 0.047779 1.478747
H  -5.476372 -1.29839 0.26865
H  -4.977114 -0.419654 -1.226921
H  -5.273253 0.495194 0.301986
