program: Gaussian 09
title: 000226596
version: EM64L-G09RevD.01
frameworkgroup: C1[X(C11H20O2)]
method: RPBEPBE
basis: SDD
operation: Freq
keyword: #pfreq=noraman
keyword: PBEPBE/SDD
title: #p freq=noraman PBEPBE/SDD
converged: YES YES NO NO
title: Mulliken charges:
elementType: O O C C C C C C C C C C C H H H H H H H H H H H H H H H H H H H H
charge: -0.282922 -0.253864 -0.019811 -0.017145 -0.141723 -0.488365 -0.507697 -0.438408 -0.410997 -0.704189 -0.718349 0.281163 -0.761229 0.228702 0.207360 0.273059 0.212443 0.211433 0.224524 0.211155 0.238080 0.194886 0.220696 0.197930 0.222647 0.211693 0.215814 0.208416 0.233805 0.215579 0.244864 0.245672 0.244781
chargesum: 0.00000
title: Mulliken charges with hydrogens summed into heavy atoms:
elementType: O O C C C C C C C C C C C
charge: -0.282922 -0.253864 0.208891 0.190215 0.131336 -0.064490 -0.072018 -0.005442 0.007628 -0.054036 -0.060549 0.281163 -0.025912
polarizability: 1.31737894e+02 -3.11701779e-01 1.26035294e+02 -3.11482480e+00 -3.12370020e+00 1.07069050e+02
1716.lowfreq: -10.3739 -0.0005 -0.0002 0.0003 8.9680 10.6177 32.7543 36.1182 43.6718
frequency: 31.3026 35.9564 43.5886 70.5854 85.8045 116.6812 117.4790 149.7988 182.4808 209.9926 218.4746 233.8646 245.5290 303.6402 343.5417 390.1466 393.5998 473.9306 533.2466 553.3653 570.2280 610.1753 634.6937 766.8652 777.1772 813.9912 842.7599 866.1010 882.1253 907.7001 935.3425 953.4074 966.0163 979.3204 996.1530 1025.2281 1032.1413 1040.5040 1044.8889 1072.2189 1084.5505 1119.3115 1143.1894 1155.9810 1181.5145 1191.7384 1210.3887 1242.1328 1247.7499 1255.0957 1271.1929 1278.3977 1296.1888 1307.0633 1322.6461 1333.0488 1334.3628 1346.7529 1348.5579 1381.0118 1386.6472 1388.3710 1453.1134 1455.7492 1463.0922 1467.5667 1471.7637 1475.3865 1476.4474 1480.6986 1484.9095 1485.1525 1637.9133 2943.6638 2963.4278 2973.1627 2973.7285 2980.8228 2981.3577 2992.9982 2998.1536 3006.0004 3029.0498 3038.9320 3046.4606 3055.1082 3066.0727 3069.4422 3070.6816 3072.5385 3075.1716 3094.1015 3141.1116
redmass: 3.0936 1.1486 6.3712 2.4798 2.2466 3.1475 2.1786 2.2991 1.5368 3.5113 1.7610 1.6380 1.4868 3.5445 2.8116 2.6273 3.1347 2.7275 2.8388 2.3653 3.1704 4.9733 2.8528 1.2493 1.3115 2.3552 2.8283 2.0390 2.0945 3.7258 1.6856 1.7108 2.1567 2.0222 1.8420 1.3108 2.4090 1.6770 2.1757 1.9659 1.8117 2.0721 2.2749 2.2603 1.7888 1.4774 3.4614 1.3390 1.2957 1.2735 1.2474 1.2416 1.2505 1.3024 1.3590 1.3966 1.4048 1.4980 1.6712 1.2544 1.2166 1.2122 1.0662 1.0477 1.0773 1.0691 1.0737 1.0548 1.0465 1.0857 1.0565 1.0609 9.0218 1.0820 1.0632 1.0359 1.0360 1.0641 1.0635 1.0624 1.0832 1.0366 1.0986 1.0976 1.0881 1.0983 1.1027 1.1003 1.0998 1.0991 1.1003 1.0974 1.1009
irintensity: 0.1049 1.8547 1.2590 0.9316 0.6320 1.5923 0.7470 0.5355 0.5504 4.1342 1.2446 1.4816 0.1425 4.4288 1.7376 0.7141 0.7981 2.3581 0.1960 5.1315 2.8825 5.9978 1.1986 14.8557 1.8044 10.7826 2.8617 7.3766 5.4933 56.1695 7.8652 5.8355 19.2750 0.5246 76.3624 0.1113 4.5713 6.8284 6.5032 0.5261 2.2669 12.1103 2.5549 22.4296 2.3432 3.7499 315.9049 3.8191 0.8136 2.4017 1.2265 0.1254 1.8885 1.6112 1.3451 0.8243 1.0488 1.1710 1.0289 55.6432 11.9391 16.2475 28.0159 18.3075 1.0601 4.6877 12.0678 15.2749 10.7935 0.4723 3.1773 16.5620 171.6526 15.8774 24.9219 32.1705 35.8351 33.5895 31.2002 45.5848 16.3458 3.4077 10.3090 1.6954 23.2871 20.1160 14.6221 25.4220 117.5626 58.1136 78.7883 8.8051 11.2257
temp: 298.150 k
press: 1.00000 atm
elementType: 8 8 6 6 6 6 6 6 6 6 6 6 6 1 1 1 1 1 1 1 1 1 1 1 1 1 1 1 1 1 1 1 1
symmnumber: 1
zpe: 760823.3 jmol-1
zpe.correction: 0.289782 hartree
zpe.thermalcorrener: 0.305213 hartree
zpe.thermalcorrenthalpy: 0.306157 hartree
zpe.thermalcorrgfe: 0.245748 hartree
zpe.sumelectzpe: -580.574617 hartree
zpe.sumelectthermal: -580.559186 hartree
zpe.sumelectthermalent: -580.558242 hartree
zpe.sumelectthermalfe: -580.618651 hartree
dipole: -0.4470 -1.4396 1.3162
dipole: 2.0011
quadrupole: -77.5716 -82.6914 -81.5420
quadrupole: -3.2290 -1.3679 6.4404
quadrupole: 3.0301 -2.0897 -0.9403 -3.2290 -1.3679 6.4404
hfenergy: -580.8643991 hartree
pointgroup: C01 [X(C11H20O2)]
dipole: 0.3642168 0.4737474 0.5125942 debye
polarizability: 130.7571348|-2.0835902|127.0235721|4.1806633|1.4894459|107.0615309 unknown
InChI: InChI=1S/C11H20O2/c1-4-9-6-7-10(5-2)11(9)13-8(3)12/h9-11H,4-7H2,1-3H3
charge 0 multiplicity 1
33 atoms
O  0.740496 -0.977981 0.479142
O  -0.41534 -2.541457 -0.811819
C  -1.303137 0.459517 0.185669
C  0.988571 1.400388 -0.073189
C  0.13455 0.137366 -0.334356
C  -1.158919 1.791943 0.99773
C  0.363458 1.974447 1.225459
C  -2.338971 0.531815 -0.962776
C  2.517915 1.197953 -0.040964
C  -3.77944 0.76982 -0.461321
C  3.106406 0.696311 -1.378283
C  0.373812 -2.276229 0.125992
C  1.06043 -3.283928 1.025336
H  -1.608276 -0.359572 0.865773
H  0.746027 2.100869 -0.903529
H  0.131184 -0.199564 -1.385832
H  -1.732671 1.773915 1.940843
H  -1.548593 2.636198 0.394244
H  0.64852 3.026552 1.406136
H  0.704893 1.37636 2.092753
H  -2.298512 -0.415762 -1.534193
H  -2.052231 1.344998 -1.662048
H  2.766343 0.483791 0.765952
H  2.990467 2.164043 0.228435
H  -3.861492 1.71713 0.103376
H  -4.102594 -0.050216 0.20764
H  -4.492627 0.81768 -1.304481
H  2.870199 1.391438 -2.206595
H  2.702033 -0.296999 -1.645475
H  4.206536 0.604692 -1.319608
H  0.76681 -3.116112 2.076284
H  2.155983 -3.162488 0.967853
H  0.781968 -4.302917 0.720554
